hadoop-mapreduce-issues mailing list archives

Site index · List index
Message view « Date » · « Thread »
Top « Date » · « Thread »
From "Hudson (JIRA)" <j...@apache.org>
Subject [jira] [Commented] (MAPREDUCE-6234) TestHighRamJob fails due to the change in MAPREDUCE-5785
Date Tue, 17 Feb 2015 22:45:14 GMT

    [ https://issues.apache.org/jira/browse/MAPREDUCE-6234?page=com.atlassian.jira.plugin.system.issuetabpanels:comment-tabpanel&focusedCommentId=14325040#comment-14325040
] 

Hudson commented on MAPREDUCE-6234:
-----------------------------------

FAILURE: Integrated in Hadoop-trunk-Commit #7136 (See [https://builds.apache.org/job/Hadoop-trunk-Commit/7136/])
MAPREDUCE-6234. TestHighRamJob fails due to the change in MAPREDUCE-5785. (Masatake Iwasaki
via kasha) (kasha: rev 409113d8f97fcfdb96cb028dbb6a20c9a1df81b0)
* hadoop-mapreduce-project/CHANGES.txt
* hadoop-tools/hadoop-gridmix/src/test/java/org/apache/hadoop/mapred/gridmix/TestHighRamJob.java


> TestHighRamJob fails due to the change in MAPREDUCE-5785
> --------------------------------------------------------
>
>                 Key: MAPREDUCE-6234
>                 URL: https://issues.apache.org/jira/browse/MAPREDUCE-6234
>             Project: Hadoop Map/Reduce
>          Issue Type: Bug
>          Components: contrib/gridmix, mrv2
>    Affects Versions: 3.0.0
>            Reporter: Masatake Iwasaki
>            Assignee: Masatake Iwasaki
>             Fix For: 3.0.0
>
>         Attachments: MAPREDUCE-6234.001.patch, MAPREDUCE-6234.002.patch, MAPREDUCE-6234.003.patch
>
>
> TestHighRamJob fails by this.
> {code}
> -------------------------------------------------------
>  T E S T S
> -------------------------------------------------------
> Running org.apache.hadoop.mapred.gridmix.TestHighRamJob
> Tests run: 1, Failures: 1, Errors: 0, Skipped: 0, Time elapsed: 1.162 sec <<<
FAILURE! - in org.apache.hadoop.mapred.gridmix.TestHighRamJob
> testHighRamFeatureEmulation(org.apache.hadoop.mapred.gridmix.TestHighRamJob)  Time elapsed:
1.102 sec  <<< FAILURE!
> java.lang.AssertionError: expected:<1024> but was:<-1>
> 	at org.junit.Assert.fail(Assert.java:88)
> 	at org.junit.Assert.failNotEquals(Assert.java:743)
> 	at org.junit.Assert.assertEquals(Assert.java:118)
> 	at org.junit.Assert.assertEquals(Assert.java:555)
> 	at org.junit.Assert.assertEquals(Assert.java:542)
> 	at org.apache.hadoop.mapred.gridmix.TestHighRamJob.testHighRamConfig(TestHighRamJob.java:98)
> 	at org.apache.hadoop.mapred.gridmix.TestHighRamJob.testHighRamFeatureEmulation(TestHighRamJob.java:117)
> {code}



--
This message was sent by Atlassian JIRA
(v6.3.4#6332)

Mime
View raw message