hadoop-mapreduce-issues mailing list archives

Site index · List index
Message view « Date » · « Thread »
Top « Date » · « Thread »
From "Varun Saxena (JIRA)" <j...@apache.org>
Subject [jira] [Updated] (MAPREDUCE-6223) TestJobConf#testNegativeValueForTaskVmem failures
Date Mon, 02 Feb 2015 23:14:34 GMT

     [ https://issues.apache.org/jira/browse/MAPREDUCE-6223?page=com.atlassian.jira.plugin.system.issuetabpanels:all-tabpanel
]

Varun Saxena updated MAPREDUCE-6223:
------------------------------------
    Attachment: MAPREDUCE-6223.002.patch

> TestJobConf#testNegativeValueForTaskVmem failures
> -------------------------------------------------
>
>                 Key: MAPREDUCE-6223
>                 URL: https://issues.apache.org/jira/browse/MAPREDUCE-6223
>             Project: Hadoop Map/Reduce
>          Issue Type: Bug
>          Components: test
>    Affects Versions: 3.0.0
>            Reporter: Gera Shegalov
>            Assignee: Varun Saxena
>         Attachments: MAPREDUCE-6223.001.patch
>
>
> {code}
> Tests run: 8, Failures: 1, Errors: 0, Skipped: 0, Time elapsed: 3.328 sec <<<
FAILURE! - in org.apache.hadoop.conf.TestJobConf
> testNegativeValueForTaskVmem(org.apache.hadoop.conf.TestJobConf)  Time elapsed: 0.089
sec  <<< FAILURE!
> java.lang.AssertionError: expected:<1024> but was:<-1>
> 	at org.junit.Assert.fail(Assert.java:88)
> 	at org.junit.Assert.failNotEquals(Assert.java:743)
> 	at org.junit.Assert.assertEquals(Assert.java:118)
> 	at org.junit.Assert.assertEquals(Assert.java:555)
> 	at org.junit.Assert.assertEquals(Assert.java:542)
> 	at org.apache.hadoop.conf.TestJobConf.testNegativeValueForTaskVmem(TestJobConf.java:111)
> {code}



--
This message was sent by Atlassian JIRA
(v6.3.4#6332)

Mime
View raw message