hadoop-mapreduce-issues mailing list archives

Site index · List index
Message view « Date » · « Thread »
Top « Date » · « Thread »
From "Hadoop QA (JIRA)" <j...@apache.org>
Subject [jira] [Commented] (MAPREDUCE-6029) TestCommitterEventHandler fails in trunk
Date Mon, 06 Oct 2014 23:09:34 GMT

    [ https://issues.apache.org/jira/browse/MAPREDUCE-6029?page=com.atlassian.jira.plugin.system.issuetabpanels:comment-tabpanel&focusedCommentId=14161182#comment-14161182
] 

Hadoop QA commented on MAPREDUCE-6029:
--------------------------------------

{color:green}+1 overall{color}.  Here are the results of testing the latest attachment 
  http://issues.apache.org/jira/secure/attachment/12673225/MAPREDUCE-6029.patch
  against trunk revision 8dc6abf.

    {color:green}+1 @author{color}.  The patch does not contain any @author tags.

    {color:green}+1 tests included{color}.  The patch appears to include 1 new or modified
test files.

    {color:green}+1 javac{color}.  The applied patch does not increase the total number of
javac compiler warnings.

    {color:green}+1 javadoc{color}.  There were no new javadoc warning messages.

    {color:green}+1 eclipse:eclipse{color}.  The patch built with eclipse:eclipse.

    {color:green}+1 findbugs{color}.  The patch does not introduce any new Findbugs (version
2.0.3) warnings.

    {color:green}+1 release audit{color}.  The applied patch does not increase the total number
of release audit warnings.

    {color:green}+1 core tests{color}.  The patch passed unit tests in hadoop-mapreduce-project/hadoop-mapreduce-client/hadoop-mapreduce-client-app.

    {color:green}+1 contrib tests{color}.  The patch passed contrib unit tests.

Test results: https://builds.apache.org/job/PreCommit-MAPREDUCE-Build/4937//testReport/
Console output: https://builds.apache.org/job/PreCommit-MAPREDUCE-Build/4937//console

This message is automatically generated.

> TestCommitterEventHandler fails in trunk
> ----------------------------------------
>
>                 Key: MAPREDUCE-6029
>                 URL: https://issues.apache.org/jira/browse/MAPREDUCE-6029
>             Project: Hadoop Map/Reduce
>          Issue Type: Bug
>    Affects Versions: 3.0.0
>            Reporter: Ted Yu
>            Assignee: Mit Desai
>         Attachments: MAPREDUCE-6029.patch, MAPREDUCE-6029.patch, MAPREDUCE-6029.patch
>
>
> From https://builds.apache.org/job/Hadoop-Mapreduce-trunk/1857/console :
> {code}
> Running org.apache.hadoop.mapreduce.v2.app.commit.TestCommitterEventHandler
> Tests run: 3, Failures: 1, Errors: 0, Skipped: 0, Time elapsed: 1.429 sec <<<
FAILURE! - in org.apache.hadoop.mapreduce.v2.app.commit.TestCommitterEventHandler
> testFailure(org.apache.hadoop.mapreduce.v2.app.commit.TestCommitterEventHandler)  Time
elapsed: 1.198 sec  <<< FAILURE!
> java.lang.AssertionError: null
> 	at org.junit.Assert.fail(Assert.java:86)
> 	at org.junit.Assert.assertTrue(Assert.java:41)
> 	at org.junit.Assert.assertNotNull(Assert.java:621)
> 	at org.junit.Assert.assertNotNull(Assert.java:631)
> 	at org.apache.hadoop.mapreduce.v2.app.commit.TestCommitterEventHandler.testFailure(TestCommitterEventHandler.java:314)
> {code}



--
This message was sent by Atlassian JIRA
(v6.3.4#6332)

Mime
View raw message