hadoop-mapreduce-issues mailing list archives

Site index · List index
Message view « Date » · « Thread »
Top « Date » · « Thread »
From "Hudson (JIRA)" <j...@apache.org>
Subject [jira] [Commented] (MAPREDUCE-5561) org.apache.hadoop.mapreduce.v2.app.job.impl.TestJobImpl testcase failing on trunk
Date Wed, 23 Oct 2013 14:05:55 GMT

    [ https://issues.apache.org/jira/browse/MAPREDUCE-5561?page=com.atlassian.jira.plugin.system.issuetabpanels:comment-tabpanel&focusedCommentId=13802884#comment-13802884
] 

Hudson commented on MAPREDUCE-5561:
-----------------------------------

FAILURE: Integrated in Hadoop-Mapreduce-trunk #1587 (See [https://builds.apache.org/job/Hadoop-Mapreduce-trunk/1587/])
MAPREDUCE-5561. org.apache.hadoop.mapreduce.v2.app.job.impl.TestJobImpl testcase failing on
trunk. Contributed by Karthik Kambatla (jlowe: http://svn.apache.org/viewcvs.cgi/?root=Apache-SVN&view=rev&rev=1534832)
* /hadoop/common/trunk/hadoop-mapreduce-project/CHANGES.txt
* /hadoop/common/trunk/hadoop-mapreduce-project/hadoop-mapreduce-client/hadoop-mapreduce-client-app/src/test/java/org/apache/hadoop/mapreduce/v2/app/job/impl/TestJobImpl.java


> org.apache.hadoop.mapreduce.v2.app.job.impl.TestJobImpl testcase failing on trunk
> ---------------------------------------------------------------------------------
>
>                 Key: MAPREDUCE-5561
>                 URL: https://issues.apache.org/jira/browse/MAPREDUCE-5561
>             Project: Hadoop Map/Reduce
>          Issue Type: Bug
>    Affects Versions: 2.2.0
>            Reporter: Cindy Li
>            Assignee: Karthik Kambatla
>            Priority: Critical
>             Fix For: 3.0.0, 2.3.0, 0.23.10, 2.2.1
>
>         Attachments: mr-5561-1.patch, org.apache.hadoop.mapreduce.v2.app.job.impl.TestJobImpl-output.txt
>
>
> Running org.apache.hadoop.mapreduce.v2.app.job.impl.TestJobImpl
> Tests run: 15, Failures: 1, Errors: 0, Skipped: 0, Time elapsed: 9.029 sec <<<
FAILURE! - in org.apache.hadoop.mapreduce.v2.app.job.impl.TestJobImpl
> testFailAbortDoesntHang(org.apache.hadoop.mapreduce.v2.app.job.impl.TestJobImpl)  Time
elapsed: 5.507 sec  <<< FAILURE!
> java.lang.AssertionError: expected:<FAIL_ABORT> but was:<FAILED>
> at org.junit.Assert.fail(Assert.java:93)
> at org.junit.Assert.failNotEquals(Assert.java:647)
> at org.junit.Assert.assertEquals(Assert.java:128)
> at org.junit.Assert.assertEquals(Assert.java:147)
> at org.apache.hadoop.mapreduce.v2.app.job.impl.TestJobImpl.assertJobState(TestJobImpl.java:817)
> at org.apache.hadoop.mapreduce.v2.app.job.impl.TestJobImpl.testFailAbortDoesntHang(TestJobImpl.java:418)



--
This message was sent by Atlassian JIRA
(v6.1#6144)

Mime
View raw message