hadoop-mapreduce-issues mailing list archives

Site index · List index
Message view « Date » · « Thread »
Top « Date » · « Thread »
From "Jason Lowe (JIRA)" <j...@apache.org>
Subject [jira] [Updated] (MAPREDUCE-5561) org.apache.hadoop.mapreduce.v2.app.job.impl.TestJobImpl testcase failing on trunk
Date Tue, 22 Oct 2013 22:52:42 GMT

     [ https://issues.apache.org/jira/browse/MAPREDUCE-5561?page=com.atlassian.jira.plugin.system.issuetabpanels:all-tabpanel
]

Jason Lowe updated MAPREDUCE-5561:
----------------------------------

       Resolution: Fixed
    Fix Version/s: 2.2.1
                   0.23.10
                   2.3.0
                   3.0.0
           Status: Resolved  (was: Patch Available)

Thanks for the contribution, Karthik, and thanks for the review Akira!  I committed this to
trunk, branch-2, branch-2.2, and branch-0.23.

> org.apache.hadoop.mapreduce.v2.app.job.impl.TestJobImpl testcase failing on trunk
> ---------------------------------------------------------------------------------
>
>                 Key: MAPREDUCE-5561
>                 URL: https://issues.apache.org/jira/browse/MAPREDUCE-5561
>             Project: Hadoop Map/Reduce
>          Issue Type: Bug
>    Affects Versions: 2.2.0
>            Reporter: Cindy Li
>            Assignee: Karthik Kambatla
>            Priority: Critical
>             Fix For: 3.0.0, 2.3.0, 0.23.10, 2.2.1
>
>         Attachments: mr-5561-1.patch, org.apache.hadoop.mapreduce.v2.app.job.impl.TestJobImpl-output.txt
>
>
> Running org.apache.hadoop.mapreduce.v2.app.job.impl.TestJobImpl
> Tests run: 15, Failures: 1, Errors: 0, Skipped: 0, Time elapsed: 9.029 sec <<<
FAILURE! - in org.apache.hadoop.mapreduce.v2.app.job.impl.TestJobImpl
> testFailAbortDoesntHang(org.apache.hadoop.mapreduce.v2.app.job.impl.TestJobImpl)  Time
elapsed: 5.507 sec  <<< FAILURE!
> java.lang.AssertionError: expected:<FAIL_ABORT> but was:<FAILED>
> at org.junit.Assert.fail(Assert.java:93)
> at org.junit.Assert.failNotEquals(Assert.java:647)
> at org.junit.Assert.assertEquals(Assert.java:128)
> at org.junit.Assert.assertEquals(Assert.java:147)
> at org.apache.hadoop.mapreduce.v2.app.job.impl.TestJobImpl.assertJobState(TestJobImpl.java:817)
> at org.apache.hadoop.mapreduce.v2.app.job.impl.TestJobImpl.testFailAbortDoesntHang(TestJobImpl.java:418)



--
This message was sent by Atlassian JIRA
(v6.1#6144)

Mime
View raw message