hadoop-mapreduce-issues mailing list archives

Site index · List index
Message view « Date » · « Thread »
Top « Date » · « Thread »
From "Akira AJISAKA (JIRA)" <j...@apache.org>
Subject [jira] [Commented] (MAPREDUCE-5561) org.apache.hadoop.mapreduce.v2.app.job.impl.TestJobImpl testcase failing on trunk
Date Tue, 22 Oct 2013 21:21:44 GMT

    [ https://issues.apache.org/jira/browse/MAPREDUCE-5561?page=com.atlassian.jira.plugin.system.issuetabpanels:comment-tabpanel&focusedCommentId=13802280#comment-13802280
] 

Akira AJISAKA commented on MAPREDUCE-5561:
------------------------------------------

+1, LGTM. I ran the test 3 times and haven't seen it fail.

> org.apache.hadoop.mapreduce.v2.app.job.impl.TestJobImpl testcase failing on trunk
> ---------------------------------------------------------------------------------
>
>                 Key: MAPREDUCE-5561
>                 URL: https://issues.apache.org/jira/browse/MAPREDUCE-5561
>             Project: Hadoop Map/Reduce
>          Issue Type: Bug
>    Affects Versions: 2.2.0
>            Reporter: Cindy Li
>            Assignee: Karthik Kambatla
>            Priority: Critical
>         Attachments: mr-5561-1.patch, org.apache.hadoop.mapreduce.v2.app.job.impl.TestJobImpl-output.txt
>
>
> Running org.apache.hadoop.mapreduce.v2.app.job.impl.TestJobImpl
> Tests run: 15, Failures: 1, Errors: 0, Skipped: 0, Time elapsed: 9.029 sec <<<
FAILURE! - in org.apache.hadoop.mapreduce.v2.app.job.impl.TestJobImpl
> testFailAbortDoesntHang(org.apache.hadoop.mapreduce.v2.app.job.impl.TestJobImpl)  Time
elapsed: 5.507 sec  <<< FAILURE!
> java.lang.AssertionError: expected:<FAIL_ABORT> but was:<FAILED>
> at org.junit.Assert.fail(Assert.java:93)
> at org.junit.Assert.failNotEquals(Assert.java:647)
> at org.junit.Assert.assertEquals(Assert.java:128)
> at org.junit.Assert.assertEquals(Assert.java:147)
> at org.apache.hadoop.mapreduce.v2.app.job.impl.TestJobImpl.assertJobState(TestJobImpl.java:817)
> at org.apache.hadoop.mapreduce.v2.app.job.impl.TestJobImpl.testFailAbortDoesntHang(TestJobImpl.java:418)



--
This message was sent by Atlassian JIRA
(v6.1#6144)

Mime
View raw message