hadoop-mapreduce-issues mailing list archives

Site index · List index
Message view « Date » · « Thread »
Top « Date » · « Thread »
From "Hudson (JIRA)" <j...@apache.org>
Subject [jira] [Commented] (MAPREDUCE-4716) TestHsWebServicesJobsQuery.testJobsQueryStateInvalid fails with jdk7
Date Fri, 11 Oct 2013 11:35:42 GMT

    [ https://issues.apache.org/jira/browse/MAPREDUCE-4716?page=com.atlassian.jira.plugin.system.issuetabpanels:comment-tabpanel&focusedCommentId=13792529#comment-13792529
] 

Hudson commented on MAPREDUCE-4716:
-----------------------------------

FAILURE: Integrated in Hadoop-Hdfs-0.23-Build #757 (See [https://builds.apache.org/job/Hadoop-Hdfs-0.23-Build/757/])
svn merge -c 1457065 FIXES: MAPREDUCE-4716. TestHsWebServicesJobsQuery.testJobsQueryStateInvalid
fails with jdk7. Contributed by Thomas Graves (jlowe: http://svn.apache.org/viewcvs.cgi/?root=Apache-SVN&view=rev&rev=1531015)
* /hadoop/common/branches/branch-0.23/hadoop-mapreduce-project/CHANGES.txt
* /hadoop/common/branches/branch-0.23/hadoop-mapreduce-project/hadoop-mapreduce-client/hadoop-mapreduce-client-hs/src/test/java/org/apache/hadoop/mapreduce/v2/hs/webapp/TestHsWebServicesJobsQuery.java


> TestHsWebServicesJobsQuery.testJobsQueryStateInvalid fails with jdk7
> --------------------------------------------------------------------
>
>                 Key: MAPREDUCE-4716
>                 URL: https://issues.apache.org/jira/browse/MAPREDUCE-4716
>             Project: Hadoop Map/Reduce
>          Issue Type: Bug
>          Components: jobhistoryserver
>    Affects Versions: 0.23.3, 3.0.0, 2.0.2-alpha
>            Reporter: Thomas Graves
>            Assignee: Thomas Graves
>              Labels: java7
>             Fix For: 2.1.0-beta, 0.23.10
>
>         Attachments: MAPREDUCE-4716.patch
>
>
> Using jdk7 TestHsWebServicesJobsQuery.testJobsQueryStateInvalid  fails.
> It looks like the string changed from "const class" to "constant" in jdk7.
> Tests run: 25, Failures: 1, Errors: 0, Skipped: 0, Time elapsed: 9.713 sec <<<
FAILURE!
> testJobsQueryStateInvalid(org.apache.hadoop.mapreduce.v2.hs.webapp.TestHsWebServicesJobsQuery)
 Time elapsed: 0.371 sec  <<< FAILURE!
> java.lang.AssertionError: exception message doesn't match, got: No enum constant org.apache.hadoop.mapreduce.v2.api.records.JobState.InvalidState
expected: No enum const class org.apache.hadoop.mapreduce.v2.api.records.JobState.InvalidState
>         at org.junit.Assert.fail(Assert.java:91)        at org.junit.Assert.assertTrue(Assert.java:43)
>         at org.apache.hadoop.yarn.webapp.WebServicesTestUtils.checkStringMatch(WebServicesTestUtils.java:77)
>         at org.apache.hadoop.mapreduce.v2.hs.webapp.TestHsWebServicesJobsQuery.testJobsQueryStateInvalid(TestHsWebServicesJobsQuery.java:286)
>         at sun.reflect.NativeMethodAccessorImpl.invoke0(Native Method)



--
This message was sent by Atlassian JIRA
(v6.1#6144)

Mime
View raw message