hadoop-mapreduce-issues mailing list archives

Site index · List index
Message view « Date » · « Thread »
Top « Date » · « Thread »
From "Sandy Ryza (JIRA)" <j...@apache.org>
Subject [jira] [Updated] (MAPREDUCE-5238) TestDistCacheEmulation.testGenerateDistCacheData is failing in trunk
Date Fri, 10 May 2013 16:57:15 GMT

     [ https://issues.apache.org/jira/browse/MAPREDUCE-5238?page=com.atlassian.jira.plugin.system.issuetabpanels:all-tabpanel
]

Sandy Ryza updated MAPREDUCE-5238:
----------------------------------

    Description: 
{noformat}

Tests run: 4, Failures: 1, Errors: 0, Skipped: 0, Time elapsed: 33.794 sec <<< FAILURE!
testGenerateDistCacheData(org.apache.hadoop.mapred.gridmix.TestDistCacheEmulation)  Time elapsed:
16767 sec  <<< FAILURE!
java.lang.AssertionError: Wrong permissions for distributed cache file /user/sandy/testSetupGenerateDistCacheData/distributedCache/26046e44bfac7cec1afce2cef15ee281
expected:<rw-r--r--> but was:<rwxr-xr-x>
        at org.junit.Assert.fail(Assert.java:91)
        at org.junit.Assert.failNotEquals(Assert.java:645)
        at org.junit.Assert.assertEquals(Assert.java:126)
        at org.apache.hadoop.mapred.gridmix.TestDistCacheEmulation.validateDistCacheFiles(TestDistCacheEmulation.java:136)
        at org.apache.hadoop.mapred.gridmix.TestDistCacheEmulation.validateDistCacheData(TestDistCacheEmulation.java:109)
        at org.apache.hadoop.mapred.gridmix.TestDistCacheEmulation.testGenerateDistCacheData(TestDistCacheEmulation.java:260)
        at sun.reflect.NativeMethodAccessorImpl.invoke0(Native Method)
        at sun.reflect.NativeMethodAccessorImpl.invoke(NativeMethodAccessorImpl.java:39)
        at sun.reflect.DelegatingMethodAccessorImpl.invoke(DelegatingMethodAccessorImpl.java:25)
        at java.lang.reflect.Method.invoke(Method.java:597)
        at org.junit.runners.model.FrameworkMethod$1.runReflectiveCall(FrameworkMethod.java:44)
        at org.junit.internal.runners.model.ReflectiveCallable.run(ReflectiveCallable.java:15)
        at org.junit.runners.model.FrameworkMethod.invokeExplosively(FrameworkMethod.java:41)
        at org.junit.internal.runners.statements.InvokeMethod.evaluate(InvokeMethod.java:20)
        at org.junit.internal.runners.statements.FailOnTimeout$1.run(FailOnTimeout.java:28)
{noformat}

  was:
{noformat

Tests run: 4, Failures: 1, Errors: 0, Skipped: 0, Time elapsed: 33.794 sec <<< FAILURE!
testGenerateDistCacheData(org.apache.hadoop.mapred.gridmix.TestDistCacheEmulation)  Time elapsed:
16767 sec  <<< FAILURE!
java.lang.AssertionError: Wrong permissions for distributed cache file /user/sandy/testSetupGenerateDistCacheData/distributedCache/26046e44bfac7cec1afce2cef15ee281
expected:<rw-r--r--> but was:<rwxr-xr-x>
        at org.junit.Assert.fail(Assert.java:91)
        at org.junit.Assert.failNotEquals(Assert.java:645)
        at org.junit.Assert.assertEquals(Assert.java:126)
        at org.apache.hadoop.mapred.gridmix.TestDistCacheEmulation.validateDistCacheFiles(TestDistCacheEmulation.java:136)
        at org.apache.hadoop.mapred.gridmix.TestDistCacheEmulation.validateDistCacheData(TestDistCacheEmulation.java:109)
        at org.apache.hadoop.mapred.gridmix.TestDistCacheEmulation.testGenerateDistCacheData(TestDistCacheEmulation.java:260)
        at sun.reflect.NativeMethodAccessorImpl.invoke0(Native Method)
        at sun.reflect.NativeMethodAccessorImpl.invoke(NativeMethodAccessorImpl.java:39)
        at sun.reflect.DelegatingMethodAccessorImpl.invoke(DelegatingMethodAccessorImpl.java:25)
        at java.lang.reflect.Method.invoke(Method.java:597)
        at org.junit.runners.model.FrameworkMethod$1.runReflectiveCall(FrameworkMethod.java:44)
        at org.junit.internal.runners.model.ReflectiveCallable.run(ReflectiveCallable.java:15)
        at org.junit.runners.model.FrameworkMethod.invokeExplosively(FrameworkMethod.java:41)
        at org.junit.internal.runners.statements.InvokeMethod.evaluate(InvokeMethod.java:20)
        at org.junit.internal.runners.statements.FailOnTimeout$1.run(FailOnTimeout.java:28)
{noformat}

    
> TestDistCacheEmulation.testGenerateDistCacheData is failing in trunk
> --------------------------------------------------------------------
>
>                 Key: MAPREDUCE-5238
>                 URL: https://issues.apache.org/jira/browse/MAPREDUCE-5238
>             Project: Hadoop Map/Reduce
>          Issue Type: Bug
>          Components: test
>    Affects Versions: 2.0.4-alpha
>            Reporter: Sandy Ryza
>
> {noformat}
> Tests run: 4, Failures: 1, Errors: 0, Skipped: 0, Time elapsed: 33.794 sec <<<
FAILURE!
> testGenerateDistCacheData(org.apache.hadoop.mapred.gridmix.TestDistCacheEmulation)  Time
elapsed: 16767 sec  <<< FAILURE!
> java.lang.AssertionError: Wrong permissions for distributed cache file /user/sandy/testSetupGenerateDistCacheData/distributedCache/26046e44bfac7cec1afce2cef15ee281
expected:<rw-r--r--> but was:<rwxr-xr-x>
>         at org.junit.Assert.fail(Assert.java:91)
>         at org.junit.Assert.failNotEquals(Assert.java:645)
>         at org.junit.Assert.assertEquals(Assert.java:126)
>         at org.apache.hadoop.mapred.gridmix.TestDistCacheEmulation.validateDistCacheFiles(TestDistCacheEmulation.java:136)
>         at org.apache.hadoop.mapred.gridmix.TestDistCacheEmulation.validateDistCacheData(TestDistCacheEmulation.java:109)
>         at org.apache.hadoop.mapred.gridmix.TestDistCacheEmulation.testGenerateDistCacheData(TestDistCacheEmulation.java:260)
>         at sun.reflect.NativeMethodAccessorImpl.invoke0(Native Method)
>         at sun.reflect.NativeMethodAccessorImpl.invoke(NativeMethodAccessorImpl.java:39)
>         at sun.reflect.DelegatingMethodAccessorImpl.invoke(DelegatingMethodAccessorImpl.java:25)
>         at java.lang.reflect.Method.invoke(Method.java:597)
>         at org.junit.runners.model.FrameworkMethod$1.runReflectiveCall(FrameworkMethod.java:44)
>         at org.junit.internal.runners.model.ReflectiveCallable.run(ReflectiveCallable.java:15)
>         at org.junit.runners.model.FrameworkMethod.invokeExplosively(FrameworkMethod.java:41)
>         at org.junit.internal.runners.statements.InvokeMethod.evaluate(InvokeMethod.java:20)
>         at org.junit.internal.runners.statements.FailOnTimeout$1.run(FailOnTimeout.java:28)
> {noformat}

--
This message is automatically generated by JIRA.
If you think it was sent incorrectly, please contact your JIRA administrators
For more information on JIRA, see: http://www.atlassian.com/software/jira

Mime
View raw message