hadoop-mapreduce-issues mailing list archives

Site index · List index
Message view « Date » · « Thread »
Top « Date » · « Thread »
From "Alejandro Abdelnur (JIRA)" <j...@apache.org>
Subject [jira] [Updated] (MAPREDUCE-4716) TestHsWebServicesJobsQuery.testJobsQueryStateInvalid fails with jdk7
Date Fri, 15 Mar 2013 19:02:13 GMT

     [ https://issues.apache.org/jira/browse/MAPREDUCE-4716?page=com.atlassian.jira.plugin.system.issuetabpanels:all-tabpanel
]

Alejandro Abdelnur updated MAPREDUCE-4716:
------------------------------------------

          Resolution: Fixed
       Fix Version/s: 2.0.5-beta
    Target Version/s: 2.0.3-alpha, 3.0.0, 0.23.7  (was: 3.0.0, 2.0.3-alpha, 0.23.7)
              Status: Resolved  (was: Patch Available)

Thanks Thomas (and Sandy for verifying still applies/works). Committed to trunk and branch-2.
                
> TestHsWebServicesJobsQuery.testJobsQueryStateInvalid fails with jdk7
> --------------------------------------------------------------------
>
>                 Key: MAPREDUCE-4716
>                 URL: https://issues.apache.org/jira/browse/MAPREDUCE-4716
>             Project: Hadoop Map/Reduce
>          Issue Type: Bug
>          Components: jobhistoryserver
>    Affects Versions: 0.23.3, 3.0.0, 2.0.2-alpha
>            Reporter: Thomas Graves
>            Assignee: Thomas Graves
>              Labels: java7
>             Fix For: 2.0.5-beta
>
>         Attachments: MAPREDUCE-4716.patch
>
>
> Using jdk7 TestHsWebServicesJobsQuery.testJobsQueryStateInvalid  fails.
> It looks like the string changed from "const class" to "constant" in jdk7.
> Tests run: 25, Failures: 1, Errors: 0, Skipped: 0, Time elapsed: 9.713 sec <<<
FAILURE!
> testJobsQueryStateInvalid(org.apache.hadoop.mapreduce.v2.hs.webapp.TestHsWebServicesJobsQuery)
 Time elapsed: 0.371 sec  <<< FAILURE!
> java.lang.AssertionError: exception message doesn't match, got: No enum constant org.apache.hadoop.mapreduce.v2.api.records.JobState.InvalidState
expected: No enum const class org.apache.hadoop.mapreduce.v2.api.records.JobState.InvalidState
>         at org.junit.Assert.fail(Assert.java:91)        at org.junit.Assert.assertTrue(Assert.java:43)
>         at org.apache.hadoop.yarn.webapp.WebServicesTestUtils.checkStringMatch(WebServicesTestUtils.java:77)
>         at org.apache.hadoop.mapreduce.v2.hs.webapp.TestHsWebServicesJobsQuery.testJobsQueryStateInvalid(TestHsWebServicesJobsQuery.java:286)
>         at sun.reflect.NativeMethodAccessorImpl.invoke0(Native Method)

--
This message is automatically generated by JIRA.
If you think it was sent incorrectly, please contact your JIRA administrators
For more information on JIRA, see: http://www.atlassian.com/software/jira

Mime
View raw message