hadoop-mapreduce-issues mailing list archives

Site index · List index
Message view « Date » · « Thread »
Top « Date » · « Thread »
From "Hudson (JIRA)" <j...@apache.org>
Subject [jira] [Commented] (MAPREDUCE-4571) TestHsWebServicesJobs fails on jdk7
Date Fri, 15 Mar 2013 19:06:14 GMT

    [ https://issues.apache.org/jira/browse/MAPREDUCE-4571?page=com.atlassian.jira.plugin.system.issuetabpanels:comment-tabpanel&focusedCommentId=13603705#comment-13603705
] 

Hudson commented on MAPREDUCE-4571:
-----------------------------------

Integrated in Hadoop-trunk-Commit #3481 (See [https://builds.apache.org/job/Hadoop-trunk-Commit/3481/])
    MAPREDUCE-4571. TestHsWebServicesJobs fails on jdk7. (tgraves via tucu) (Revision 1457061)

     Result = SUCCESS
tucu : http://svn.apache.org/viewcvs.cgi/?root=Apache-SVN&view=rev&rev=1457061
Files : 
* /hadoop/common/trunk/hadoop-mapreduce-project/CHANGES.txt
* /hadoop/common/trunk/hadoop-mapreduce-project/hadoop-mapreduce-client/hadoop-mapreduce-client-hs/src/test/java/org/apache/hadoop/mapreduce/v2/hs/MockHistoryJobs.java
* /hadoop/common/trunk/hadoop-mapreduce-project/hadoop-mapreduce-client/hadoop-mapreduce-client-hs/src/test/java/org/apache/hadoop/mapreduce/v2/hs/webapp/TestHsWebServicesJobs.java

                
> TestHsWebServicesJobs fails on jdk7
> -----------------------------------
>
>                 Key: MAPREDUCE-4571
>                 URL: https://issues.apache.org/jira/browse/MAPREDUCE-4571
>             Project: Hadoop Map/Reduce
>          Issue Type: Bug
>          Components: webapps
>    Affects Versions: 0.23.3, 3.0.0, 2.0.2-alpha
>            Reporter: Thomas Graves
>            Assignee: Thomas Graves
>              Labels: java7
>             Fix For: 2.0.5-beta
>
>         Attachments: MAPREDUCE-4571.patch
>
>
> TestHsWebServicesJobs fails on jdk7. 
> Tests run: 22, Failures: 1, Errors: 0, Skipped: 0, Time elapsed: 7.561 sec <<<
FAILURE!testJobIdSlash(org.apache.hadoop.mapreduce.v2.hs.webapp.TestHsWebServicesJobs)  Time
elapsed: 0.334 sec  <<< FAILURE!
> java.lang.AssertionError: mapsTotal incorrect expected:<0> but was:<1>

--
This message is automatically generated by JIRA.
If you think it was sent incorrectly, please contact your JIRA administrators
For more information on JIRA, see: http://www.atlassian.com/software/jira

Mime
View raw message