hadoop-mapreduce-issues mailing list archives

Site index · List index
Message view « Date » · « Thread »
Top « Date » · « Thread »
From "Hadoop QA (JIRA)" <j...@apache.org>
Subject [jira] [Commented] (MAPREDUCE-4716) TestHsWebServicesJobsQuery.testJobsQueryStateInvalid fails with jdk7
Date Tue, 09 Oct 2012 23:16:03 GMT

    [ https://issues.apache.org/jira/browse/MAPREDUCE-4716?page=com.atlassian.jira.plugin.system.issuetabpanels:comment-tabpanel&focusedCommentId=13472850#comment-13472850
] 

Hadoop QA commented on MAPREDUCE-4716:
--------------------------------------

{color:green}+1 overall{color}.  Here are the results of testing the latest attachment 
  http://issues.apache.org/jira/secure/attachment/12548428/MAPREDUCE-4716.patch
  against trunk revision .

    {color:green}+1 @author{color}.  The patch does not contain any @author tags.

    {color:green}+1 tests included{color}.  The patch appears to include 1 new or modified
test files.

    {color:green}+1 javac{color}.  The applied patch does not increase the total number of
javac compiler warnings.

    {color:green}+1 javadoc{color}.  The javadoc tool did not generate any warning messages.

    {color:green}+1 eclipse:eclipse{color}.  The patch built with eclipse:eclipse.

    {color:green}+1 findbugs{color}.  The patch does not introduce any new Findbugs (version
1.3.9) warnings.

    {color:green}+1 release audit{color}.  The applied patch does not increase the total number
of release audit warnings.

    {color:green}+1 core tests{color}.  The patch passed unit tests in hadoop-mapreduce-project/hadoop-mapreduce-client/hadoop-mapreduce-client-hs.

    {color:green}+1 contrib tests{color}.  The patch passed contrib unit tests.

Test results: https://builds.apache.org/job/PreCommit-MAPREDUCE-Build/2922//testReport/
Console output: https://builds.apache.org/job/PreCommit-MAPREDUCE-Build/2922//console

This message is automatically generated.
                
> TestHsWebServicesJobsQuery.testJobsQueryStateInvalid fails with jdk7
> --------------------------------------------------------------------
>
>                 Key: MAPREDUCE-4716
>                 URL: https://issues.apache.org/jira/browse/MAPREDUCE-4716
>             Project: Hadoop Map/Reduce
>          Issue Type: Bug
>          Components: jobhistoryserver
>    Affects Versions: 0.23.3, 3.0.0, 2.0.2-alpha
>            Reporter: Thomas Graves
>            Assignee: Thomas Graves
>              Labels: java7
>         Attachments: MAPREDUCE-4716.patch
>
>
> Using jdk7 TestHsWebServicesJobsQuery.testJobsQueryStateInvalid  fails.
> It looks like the string changed from "const class" to "constant" in jdk7.
> Tests run: 25, Failures: 1, Errors: 0, Skipped: 0, Time elapsed: 9.713 sec <<<
FAILURE!
> testJobsQueryStateInvalid(org.apache.hadoop.mapreduce.v2.hs.webapp.TestHsWebServicesJobsQuery)
 Time elapsed: 0.371 sec  <<< FAILURE!
> java.lang.AssertionError: exception message doesn't match, got: No enum constant org.apache.hadoop.mapreduce.v2.api.records.JobState.InvalidState
expected: No enum const class org.apache.hadoop.mapreduce.v2.api.records.JobState.InvalidState
>         at org.junit.Assert.fail(Assert.java:91)        at org.junit.Assert.assertTrue(Assert.java:43)
>         at org.apache.hadoop.yarn.webapp.WebServicesTestUtils.checkStringMatch(WebServicesTestUtils.java:77)
>         at org.apache.hadoop.mapreduce.v2.hs.webapp.TestHsWebServicesJobsQuery.testJobsQueryStateInvalid(TestHsWebServicesJobsQuery.java:286)
>         at sun.reflect.NativeMethodAccessorImpl.invoke0(Native Method)

--
This message is automatically generated by JIRA.
If you think it was sent incorrectly, please contact your JIRA administrators
For more information on JIRA, see: http://www.atlassian.com/software/jira

Mime
View raw message