hadoop-mapreduce-issues mailing list archives

Site index · List index
Message view « Date » · « Thread »
Top « Date » · « Thread »
From "Thomas Graves (JIRA)" <j...@apache.org>
Subject [jira] [Updated] (MAPREDUCE-4571) TestHsWebServicesJobs fails on jdk7
Date Thu, 23 Aug 2012 16:05:43 GMT

     [ https://issues.apache.org/jira/browse/MAPREDUCE-4571?page=com.atlassian.jira.plugin.system.issuetabpanels:all-tabpanel
]

Thomas Graves updated MAPREDUCE-4571:
-------------------------------------

    Attachment: MAPREDUCE-4571.patch

Fix MockCompletedJobs to match the history server PartialJob and have completed=total.  Also
fix the test to pass in the full jobs to compare to the webservices full jobs.
                
> TestHsWebServicesJobs fails on jdk7
> -----------------------------------
>
>                 Key: MAPREDUCE-4571
>                 URL: https://issues.apache.org/jira/browse/MAPREDUCE-4571
>             Project: Hadoop Map/Reduce
>          Issue Type: Bug
>          Components: webapps
>    Affects Versions: 0.23.3, 3.0.0, 2.2.0-alpha
>            Reporter: Thomas Graves
>            Assignee: Thomas Graves
>              Labels: java7
>         Attachments: MAPREDUCE-4571.patch
>
>
> TestHsWebServicesJobs fails on jdk7. 
> Tests run: 22, Failures: 1, Errors: 0, Skipped: 0, Time elapsed: 7.561 sec <<<
FAILURE!testJobIdSlash(org.apache.hadoop.mapreduce.v2.hs.webapp.TestHsWebServicesJobs)  Time
elapsed: 0.334 sec  <<< FAILURE!
> java.lang.AssertionError: mapsTotal incorrect expected:<0> but was:<1>

--
This message is automatically generated by JIRA.
If you think it was sent incorrectly, please contact your JIRA administrators: https://issues.apache.org/jira/secure/ContactAdministrators!default.jspa
For more information on JIRA, see: http://www.atlassian.com/software/jira

        

Mime
View raw message