hadoop-mapreduce-issues mailing list archives

Site index · List index
Message view « Date » · « Thread »
Top « Date » · « Thread »
From "Arun C Murthy (JIRA)" <j...@apache.org>
Subject [jira] [Created] (MAPREDUCE-4236) Failing tests in branch-2
Date Wed, 09 May 2012 03:19:26 GMT
Arun C Murthy created MAPREDUCE-4236:
----------------------------------------

             Summary: Failing tests in branch-2
                 Key: MAPREDUCE-4236
                 URL: https://issues.apache.org/jira/browse/MAPREDUCE-4236
             Project: Hadoop Map/Reduce
          Issue Type: Bug
    Affects Versions: 2.0.0
            Reporter: Arun C Murthy
            Priority: Critical
             Fix For: 2.0.0


Running org.apache.hadoop.mapreduce.v2.app.TestStagingCleanup
Tests run: 2, Failures: 0, Errors: 1, Skipped: 0, Time elapsed: 7.872 sec <<< FAILURE!
--
Running org.apache.hadoop.mapreduce.v2.hs.TestJobHistoryEvents
Tests run: 3, Failures: 0, Errors: 1, Skipped: 0, Time elapsed: 3.862 sec <<< FAILURE!
--
Running org.apache.hadoop.conf.TestNoDefaultsJobConf
Tests run: 1, Failures: 0, Errors: 1, Skipped: 0, Time elapsed: 10.865 sec <<< FAILURE!
--
Running org.apache.hadoop.mapreduce.security.TestJHSSecurity
Tests run: 1, Failures: 0, Errors: 1, Skipped: 0, Time elapsed: 1.372 sec <<< FAILURE!

--
This message is automatically generated by JIRA.
If you think it was sent incorrectly, please contact your JIRA administrators: https://issues.apache.org/jira/secure/ContactAdministrators!default.jspa
For more information on JIRA, see: http://www.atlassian.com/software/jira

        

Mime
View raw message