hadoop-mapreduce-issues mailing list archives

Site index · List index
Message view « Date » · « Thread »
Top « Date » · « Thread »
From "Ravi Prakash (Commented) (JIRA)" <j...@apache.org>
Subject [jira] [Commented] (MAPREDUCE-3135) Unit test org.apache.hadoop.mapred.TestJobHistoryServer fails intermittently
Date Mon, 03 Oct 2011 01:06:34 GMT

    [ https://issues.apache.org/jira/browse/MAPREDUCE-3135?page=com.atlassian.jira.plugin.system.issuetabpanels:comment-tabpanel&focusedCommentId=13119114#comment-13119114
] 

Ravi Prakash commented on MAPREDUCE-3135:
-----------------------------------------

export COUNT=0; while [ 1 == 1 ] ; do echo -n "Tested $COUNT times. "; ant -Dtestcase=TestJobHistoryServer
test > /tmp/outputFile ; if [ "`grep "BUILD FAILED" /tmp/outputFile`" ]; then find . -name
TEST*TestJobHistoryServer* | xargs -I{} cp {} ~ ; echo "Test failed"; else echo "Test passed";
fi; let COUNT++; done;

Tested 0 times. Test passed
Tested 1 times. Test passed
Tested 2 times. Test passed
Tested 3 times. Test passed
Tested 4 times. Test passed
Tested 5 times. Test passed
Tested 6 times. Test passed
Tested 7 times. Test passed
Tested 8 times. Test passed
Tested 9 times. Test passed
Tested 10 times. Test passed
Tested 11 times. Test passed
Tested 12 times. Test passed
Tested 13 times. Test passed
Tested 14 times. Test passed
Tested 15 times. Test passed
Tested 16 times. Test passed
Tested 17 times. Test passed
Tested 18 times. Test passed
Tested 19 times. Test passed
Tested 20 times. Test passed
Tested 21 times. Test passed
Tested 22 times.     [junit] Test org.apache.hadoop.mapred.TestJobHistoryServer FAILED (timeout)

BUILD FAILED
/home/raviprak/Code/hadoop/0.20/build.xml:1137: Tests failed!

Total time: 15 minutes 13 seconds
Test passed
Tested 23 times. Test passed
Tested 24 times. Test passed
Tested 25 times. Test passed
Tested 26 times. Test passed
Tested 27 times. Test passed
Tested 28 times. Test passed
Tested 29 times. Test passed
Tested 30 times. Test passed
Tested 31 times. Test passed
Tested 32 times. Test passed
Tested 33 times. Test passed
Tested 34 times. Test passed
Tested 35 times. Test passed
Tested 36 times.     [junit] Test org.apache.hadoop.mapred.TestJobHistoryServer FAILED (timeout)

BUILD FAILED
/home/raviprak/Code/hadoop/0.20/build.xml:1137: Tests failed!

Total time: 15 minutes 14 seconds
Test passed
Tested 37 times. Test passed
Tested 38 times. Test passed
Tested 39 times. Test passed
Tested 40 times. Test passed
Tested 41 times. Test passed
Tested 42 times. Test passed
Tested 43 times. Test passed
Tested 44 times. Test passed
Tested 45 times. Test passed
Tested 46 times. Test passed
Tested 47 times. Test passed
Tested 48 times. Test passed
Tested 49 times. Test passed
Tested 50 times. Test passed
Tested 51 times. Test passed
Tested 52 times. Test passed
Tested 53 times.     [junit] Test org.apache.hadoop.mapred.TestJobHistoryServer FAILED (timeout)

BUILD FAILED
/home/raviprak/Code/hadoop/0.20/build.xml:1137: Tests failed!

Total time: 15 minutes 14 seconds
Test passed
Tested 54 times. Test passed
Tested 55 times. Test passed
Tested 56 times. Test passed
Tested 57 times. Test passed
Tested 58 times. Test passed
Tested 59 times.     [junit] Test org.apache.hadoop.mapred.TestJobHistoryServer FAILED (timeout)

BUILD FAILED
/home/raviprak/Code/hadoop/0.20/build.xml:1137: Tests failed!

Total time: 15 minutes 14 seconds
Test passed
Tested 60 times.     [junit] Test org.apache.hadoop.mapred.TestJobHistoryServer FAILED (timeout)

BUILD FAILED
/home/raviprak/Code/hadoop/0.20/build.xml:1137: Tests failed!

Total time: 15 minutes 14 seconds
Test passed
Tested 61 times.     [junit] Test org.apache.hadoop.mapred.TestJobHistoryServer FAILED (timeout)

BUILD FAILED
/home/raviprak/Code/hadoop/0.20/build.xml:1137: Tests failed!

Total time: 15 minutes 14 seconds
Test passed
Tested 62 times. Test passed
Tested 63 times. Test passed
Tested 64 times. Test passed
Tested 65 times. Test passed
Tested 66 times. Test passed
Tested 67 times. Test passed
Tested 68 times. Test passed
Tested 69 times. Test passed
Tested 70 times. Test passed
Tested 71 times. Test passed
Tested 72 times. Test passed
Tested 73 times. Test passed
Tested 74 times. Test passed
Tested 75 times. Test passed
Tested 76 times. Test passed
Tested 77 times. Test passed
Tested 78 times. Test passed
Tested 79 times. Test passed
Tested 80 times. Test passed
Tested 81 times. Test passed
Tested 82 times. Test passed
Tested 83 times. Test passed
Tested 84 times. Test passed
Tested 85 times. Test passed
Tested 86 times. Test passed
Tested 87 times. Test passed
Tested 88 times. Test passed
Tested 89 times. Test passed
Tested 90 times. Test passed
Tested 91 times. Test passed



The TEST file has just one line : 
{noformat}
[raviprak@localhost 0.20]$ cat ~/TEST-org.apache.hadoop.mapred.TestJobHistoryServer.txt 
Testsuite: org.apache.hadoop.mapred.TestJobHistoryServer
{noformat}
                
> Unit test org.apache.hadoop.mapred.TestJobHistoryServer fails intermittently
> ----------------------------------------------------------------------------
>
>                 Key: MAPREDUCE-3135
>                 URL: https://issues.apache.org/jira/browse/MAPREDUCE-3135
>             Project: Hadoop Map/Reduce
>          Issue Type: Bug
>    Affects Versions: 0.20.205.1
>            Reporter: Ravi Prakash
>
> Every once in a while org.apache.hadoop.mapred.TestJobHistoryServer fails due to a timeout.

--
This message is automatically generated by JIRA.
If you think it was sent incorrectly, please contact your JIRA administrators: https://issues.apache.org/jira/secure/ContactAdministrators!default.jspa
For more information on JIRA, see: http://www.atlassian.com/software/jira

        

Mime
View raw message