hadoop-mapreduce-issues mailing list archives

Site index · List index
Message view « Date » · « Thread »
Top « Date » · « Thread »
From "Hudson (Commented) (JIRA)" <j...@apache.org>
Subject [jira] [Commented] (MAPREDUCE-3285) Tests on branch-0.23 failing
Date Fri, 28 Oct 2011 12:48:43 GMT

    [ https://issues.apache.org/jira/browse/MAPREDUCE-3285?page=com.atlassian.jira.plugin.system.issuetabpanels:comment-tabpanel&focusedCommentId=13138291#comment-13138291
] 

Hudson commented on MAPREDUCE-3285:
-----------------------------------

Integrated in Hadoop-Hdfs-0.23-Build #53 (See [https://builds.apache.org/job/Hadoop-Hdfs-0.23-Build/53/])
    MAPREDUCE-3285. Tests on branch-0.23 failing (Siddharth Seth via mahadev)

mahadev : http://svn.apache.org/viewcvs.cgi/?root=Apache-SVN&view=rev&rev=1190138
Files : 
* /hadoop/common/branches/branch-0.23/hadoop-mapreduce-project/CHANGES.txt
* /hadoop/common/branches/branch-0.23/hadoop-mapreduce-project/hadoop-yarn/hadoop-yarn-server/hadoop-yarn-server-resourcemanager/pom.xml
* /hadoop/common/branches/branch-0.23/hadoop-mapreduce-project/hadoop-yarn/pom.xml

                
> Tests on branch-0.23 failing 
> -----------------------------
>
>                 Key: MAPREDUCE-3285
>                 URL: https://issues.apache.org/jira/browse/MAPREDUCE-3285
>             Project: Hadoop Map/Reduce
>          Issue Type: Bug
>          Components: mrv2
>            Reporter: Arun C Murthy
>            Assignee: Siddharth Seth
>            Priority: Blocker
>             Fix For: 0.23.0
>
>         Attachments: MR3285.txt
>
>
> Most are failing with some kerberos login exception:
> Running org.apache.hadoop.yarn.server.nodemanager.TestLinuxContainerExecutorWithMocks
> Tests run: 3, Failures: 1, Errors: 0, Skipped: 0, Time elapsed: 0.548 sec <<<
FAILURE!
> --
> Running org.apache.hadoop.yarn.server.resourcemanager.TestAppManager
> Tests run: 8, Failures: 0, Errors: 6, Skipped: 0, Time elapsed: 0.125 sec <<<
FAILURE!
> Running org.apache.hadoop.yarn.server.resourcemanager.TestRMAuditLogger
> Tests run: 3, Failures: 0, Errors: 1, Skipped: 0, Time elapsed: 0.065 sec <<<
FAILURE!
> --
> Running org.apache.hadoop.yarn.server.resourcemanager.TestApplicationCleanup
> Tests run: 1, Failures: 0, Errors: 1, Skipped: 0, Time elapsed: 0.033 sec <<<
FAILURE!
> --
> Running org.apache.hadoop.yarn.server.resourcemanager.applicationsmanager.TestAMRMRPCResponseId
> Tests run: 1, Failures: 0, Errors: 1, Skipped: 0, Time elapsed: 0.024 sec <<<
FAILURE!
> --
> Running org.apache.hadoop.yarn.server.resourcemanager.TestRM
> Tests run: 3, Failures: 0, Errors: 3, Skipped: 0, Time elapsed: 0.072 sec <<<
FAILURE!
> Running org.apache.hadoop.yarn.server.resourcemanager.TestApplicationACLs
> Tests run: 1, Failures: 0, Errors: 1, Skipped: 0, Time elapsed: 90.167 sec <<<
FAILURE!
> Running org.apache.hadoop.yarn.server.resourcemanager.TestFifoScheduler
> Tests run: 1, Failures: 0, Errors: 1, Skipped: 0, Time elapsed: 0.056 sec <<<
FAILURE!
> TestLinuxContainerExecutorWithMocks is tracked via MAPREDUCE-3281

--
This message is automatically generated by JIRA.
If you think it was sent incorrectly, please contact your JIRA administrators: https://issues.apache.org/jira/secure/ContactAdministrators!default.jspa
For more information on JIRA, see: http://www.atlassian.com/software/jira

        

Mime
View raw message