hadoop-mapreduce-dev mailing list archives

Site index · List index
Message view « Date » · « Thread »
Top « Date » · « Thread »
From Apache Jenkins Server <jenk...@builds.apache.org>
Subject Hadoop-Mapreduce-trunk-Java8 - Build # 13 - Failure
Date Sat, 22 Nov 2014 15:37:23 GMT
See https://builds.apache.org/job/Hadoop-Mapreduce-trunk-Java8/13/

###################################################################################
########################## LAST 60 LINES OF THE CONSOLE ###########################
[...truncated 31109 lines...]
  TestClusterMRNotification>NotificationTestCase.testMR:156->NotificationTestCase.launchWordCount:241
» IO
  TestClusterMapReduceTestCase.testMapReduceRestarting:93->_testMapReduce:67 » IO
  TestClusterMapReduceTestCase.testMapReduce:89->_testMapReduce:67 » IO Job fail...
  TestReduceFetchFromPartialMem.testReduceFromPartialMem:93->runJob:300 » IO Job...
  TestJobName.testComplexNameWithRegex:89 » IO Job failed!
  TestJobName.testComplexName:55 » IO Job failed!
  TestReduceFetchFromPartialMem.testReduceFromPartialMem:93->runJob:300 » IO Job...

Tests run: 514, Failures: 40, Errors: 8, Skipped: 11

[INFO] ------------------------------------------------------------------------
[INFO] Reactor Summary:
[INFO] 
[INFO] hadoop-mapreduce-client ........................... SUCCESS [  2.586 s]
[INFO] hadoop-mapreduce-client-core ...................... SUCCESS [ 59.202 s]
[INFO] hadoop-mapreduce-client-common .................... SUCCESS [ 27.563 s]
[INFO] hadoop-mapreduce-client-shuffle ................... SUCCESS [  4.295 s]
[INFO] hadoop-mapreduce-client-app ....................... SUCCESS [09:02 min]
[INFO] hadoop-mapreduce-client-hs ........................ SUCCESS [05:11 min]
[INFO] hadoop-mapreduce-client-jobclient ................. FAILURE [  01:57 h]
[INFO] hadoop-mapreduce-client-hs-plugins ................ SKIPPED
[INFO] hadoop-mapreduce-client-nativetask ................ SKIPPED
[INFO] Apache Hadoop MapReduce Examples .................. SKIPPED
[INFO] hadoop-mapreduce .................................. SKIPPED
[INFO] ------------------------------------------------------------------------
[INFO] BUILD FAILURE
[INFO] ------------------------------------------------------------------------
[INFO] Total time: 02:13 h
[INFO] Finished at: 2014-11-22T15:37:02+00:00
[INFO] Final Memory: 42M/689M
[INFO] ------------------------------------------------------------------------
[ERROR] Failed to execute goal org.apache.maven.plugins:maven-surefire-plugin:2.16:test (default-test)
on project hadoop-mapreduce-client-jobclient: There was a timeout or other error in the fork
-> [Help 1]
[ERROR] 
[ERROR] To see the full stack trace of the errors, re-run Maven with the -e switch.
[ERROR] Re-run Maven using the -X switch to enable full debug logging.
[ERROR] 
[ERROR] For more information about the errors and possible solutions, please read the following
articles:
[ERROR] [Help 1] http://cwiki.apache.org/confluence/display/MAVEN/MojoFailureException
[ERROR] 
[ERROR] After correcting the problems, you can resume the build with the command
[ERROR]   mvn <goals> -rf :hadoop-mapreduce-client-jobclient
Build step 'Execute shell' marked build as failure
[FINDBUGS] Skipping publisher since build result is FAILURE
Archiving artifacts
Sending artifact delta relative to Hadoop-Mapreduce-trunk-Java8 #12
Archived 2 artifacts
Archive block size is 32768
Received 0 blocks and 20248472 bytes
Compression is 0.0%
Took 11 sec
Updating HDFS-7331
Updating YARN-2604
Updating HDFS-7420
Updating MAPREDUCE-5785
Updating HDFS-7425
Updating YARN-2679
Updating YARN-2669
Email was triggered for: Failure
Sending email for trigger: Failure



###################################################################################
############################## FAILED TESTS (if any) ##############################
No tests ran.
Mime
  • Unnamed multipart/mixed (inline, None, 0 bytes)
View raw message