hadoop-mapreduce-dev mailing list archives

Site index · List index
Message view « Date » · « Thread »
Top « Date » · « Thread »
From Apache Jenkins Server <jenk...@builds.apache.org>
Subject Hadoop-Mapreduce-trunk - Build # 1806 - Still Failing
Date Thu, 19 Jun 2014 15:17:34 GMT
See https://builds.apache.org/job/Hadoop-Mapreduce-trunk/1806/

###################################################################################
########################## LAST 60 LINES OF THE CONSOLE ###########################
[...truncated 36199 lines...]

Results :

Tests run: 494, Failures: 0, Errors: 0, Skipped: 11

[INFO] ------------------------------------------------------------------------
[INFO] Reactor Summary:
[INFO] 
[INFO] hadoop-mapreduce-client ........................... SUCCESS [2.489s]
[INFO] hadoop-mapreduce-client-core ...................... SUCCESS [54.518s]
[INFO] hadoop-mapreduce-client-common .................... SUCCESS [25.719s]
[INFO] hadoop-mapreduce-client-shuffle ................... SUCCESS [4.243s]
[INFO] hadoop-mapreduce-client-app ....................... SUCCESS [7:03.649s]
[INFO] hadoop-mapreduce-client-hs ........................ SUCCESS [4:43.868s]
[INFO] hadoop-mapreduce-client-jobclient ................. FAILURE [1:38:01.247s]
[INFO] hadoop-mapreduce-client-hs-plugins ................ SKIPPED
[INFO] Apache Hadoop MapReduce Examples .................. SKIPPED
[INFO] hadoop-mapreduce .................................. SKIPPED
[INFO] ------------------------------------------------------------------------
[INFO] BUILD FAILURE
[INFO] ------------------------------------------------------------------------
[INFO] Total time: 1:51:16.770s
[INFO] Finished at: Thu Jun 19 15:17:10 UTC 2014
[INFO] Final Memory: 28M/91M
[INFO] ------------------------------------------------------------------------
[ERROR] Failed to execute goal org.apache.maven.plugins:maven-surefire-plugin:2.16:test (default-test)
on project hadoop-mapreduce-client-jobclient: There was a timeout or other error in the fork
-> [Help 1]
[ERROR] 
[ERROR] To see the full stack trace of the errors, re-run Maven with the -e switch.
[ERROR] Re-run Maven using the -X switch to enable full debug logging.
[ERROR] 
[ERROR] For more information about the errors and possible solutions, please read the following
articles:
[ERROR] [Help 1] http://cwiki.apache.org/confluence/display/MAVEN/MojoFailureException
[ERROR] 
[ERROR] After correcting the problems, you can resume the build with the command
[ERROR]   mvn <goals> -rf :hadoop-mapreduce-client-jobclient
Build step 'Execute shell' marked build as failure
[FINDBUGS] Skipping publisher since build result is FAILURE
Archiving artifacts
Sending artifact delta relative to Hadoop-Mapreduce-trunk #1765
Archived 2 artifacts
Archive block size is 32768
Received 0 blocks and 16953638 bytes
Compression is 0.0%
Took 11 sec
Updating HDFS-6530
Updating MAPREDUCE-5896
Updating HDFS-6480
Updating HDFS-6551
Updating HADOOP-10711
Updating HADOOP-10607
Updating HDFS-6553
Updating HDFS-6552
Updating HDFS-6439
Updating HDFS-6559
Updating HADOOP-10716
Updating HDFS-6563
Updating HADOOP-10717
Email was triggered for: Failure
Sending email for trigger: Failure



###################################################################################
############################## FAILED TESTS (if any) ##############################
No tests ran.
Mime
  • Unnamed multipart/mixed (inline, None, 0 bytes)
View raw message