hadoop-mapreduce-dev mailing list archives

Site index · List index
Message view « Date » · « Thread »
Top « Date » · « Thread »
From Apache Jenkins Server <jenk...@builds.apache.org>
Subject Hadoop-Mapreduce-trunk - Build # 1799 - Still Failing
Date Thu, 12 Jun 2014 15:18:58 GMT
See https://builds.apache.org/job/Hadoop-Mapreduce-trunk/1799/

###################################################################################
########################## LAST 60 LINES OF THE CONSOLE ###########################
[...truncated 35019 lines...]
Results :

Tests run: 494, Failures: 0, Errors: 0, Skipped: 11

[INFO] ------------------------------------------------------------------------
[INFO] Reactor Summary:
[INFO] 
[INFO] hadoop-mapreduce-client ........................... SUCCESS [3.592s]
[INFO] hadoop-mapreduce-client-core ...................... SUCCESS [53.844s]
[INFO] hadoop-mapreduce-client-common .................... SUCCESS [26.780s]
[INFO] hadoop-mapreduce-client-shuffle ................... SUCCESS [4.334s]
[INFO] hadoop-mapreduce-client-app ....................... SUCCESS [7:05.083s]
[INFO] hadoop-mapreduce-client-hs ........................ SUCCESS [4:43.507s]
[INFO] hadoop-mapreduce-client-jobclient ................. FAILURE [1:37:35.628s]
[INFO] hadoop-mapreduce-client-hs-plugins ................ SKIPPED
[INFO] Apache Hadoop MapReduce Examples .................. SKIPPED
[INFO] hadoop-mapreduce .................................. SKIPPED
[INFO] ------------------------------------------------------------------------
[INFO] BUILD FAILURE
[INFO] ------------------------------------------------------------------------
[INFO] Total time: 1:50:54.388s
[INFO] Finished at: Thu Jun 12 15:17:08 UTC 2014
[INFO] Final Memory: 29M/61M
[INFO] ------------------------------------------------------------------------
[ERROR] Failed to execute goal org.apache.maven.plugins:maven-surefire-plugin:2.16:test (default-test)
on project hadoop-mapreduce-client-jobclient: There was a timeout or other error in the fork
-> [Help 1]
[ERROR] 
[ERROR] To see the full stack trace of the errors, re-run Maven with the -e switch.
[ERROR] Re-run Maven using the -X switch to enable full debug logging.
[ERROR] 
[ERROR] For more information about the errors and possible solutions, please read the following
articles:
[ERROR] [Help 1] http://cwiki.apache.org/confluence/display/MAVEN/MojoFailureException
[ERROR] 
[ERROR] After correcting the problems, you can resume the build with the command
[ERROR]   mvn <goals> -rf :hadoop-mapreduce-client-jobclient
Build step 'Execute shell' marked build as failure
[FINDBUGS] Skipping publisher since build result is FAILURE
Archiving artifacts
Sending artifact delta relative to Hadoop-Mapreduce-trunk #1765
Archived 2 artifacts
Archive block size is 32768
Received 0 blocks and 16948440 bytes
Compression is 0.0%
Took 9.7 sec
Updating HADOOP-10622
Updating HADOOP-10656
Updating HDFS-6503
Updating HADOOP-10686
Updating HDFS-6471
Updating HDFS-6379
Updating HDFS-2006
Updating YARN-2124
Updating YARN-2125
Updating YARN-2075
Updating YARN-2148
Updating HADOOP-10376
Updating HDFS-6315
Updating MAPREDUCE-5920
Email was triggered for: Failure
Sending email for trigger: Failure



###################################################################################
############################## FAILED TESTS (if any) ##############################
No tests ran.
Mime
  • Unnamed multipart/mixed (inline, None, 0 bytes)
View raw message