hadoop-mapreduce-dev mailing list archives

Site index · List index
Message view « Date » · « Thread »
Top « Date » · « Thread »
From Apache Jenkins Server <jenk...@builds.apache.org>
Subject Hadoop-Mapreduce-trunk - Build # 1784 - Still Failing
Date Wed, 28 May 2014 15:16:29 GMT
See https://builds.apache.org/job/Hadoop-Mapreduce-trunk/1784/

###################################################################################
########################## LAST 60 LINES OF THE CONSOLE ###########################
[...truncated 34537 lines...]
Running org.apache.hadoop.mapreduce.lib.partition.TestKeyFieldHelper
Tests run: 3, Failures: 0, Errors: 0, Skipped: 0, Time elapsed: 0.148 sec - in org.apache.hadoop.mapreduce.lib.partition.TestKeyFieldHelper
Running org.apache.hadoop.mapreduce.lib.partition.TestBinaryPartitioner
Tests run: 4, Failures: 0, Errors: 0, Skipped: 0, Time elapsed: 0.524 sec - in org.apache.hadoop.mapreduce.lib.partition.TestBinaryPartitioner
Running org.apache.hadoop.mapreduce.lib.partition.TestMRKeyFieldBasedPartitioner
Tests run: 1, Failures: 0, Errors: 0, Skipped: 0, Time elapsed: 0.455 sec - in org.apache.hadoop.mapreduce.lib.partition.TestMRKeyFieldBasedPartitioner
Running org.apache.hadoop.mapreduce.TestChild
Tests run: 1, Failures: 0, Errors: 0, Skipped: 0, Time elapsed: 81.629 sec - in org.apache.hadoop.mapreduce.TestChild
Running org.apache.hadoop.mapreduce.filecache.TestURIFragments
Tests run: 1, Failures: 0, Errors: 0, Skipped: 0, Time elapsed: 0.065 sec - in org.apache.hadoop.mapreduce.filecache.TestURIFragments
Running org.apache.hadoop.mapreduce.TestMapReduce
Tests run: 1, Failures: 0, Errors: 0, Skipped: 0, Time elapsed: 6.015 sec - in org.apache.hadoop.mapreduce.TestMapReduce
Running org.apache.hadoop.mapreduce.TestNewCombinerGrouping
Tests run: 1, Failures: 0, Errors: 0, Skipped: 0, Time elapsed: 6.598 sec - in org.apache.hadoop.mapreduce.TestNewCombinerGrouping

Results :

Tests run: 494, Failures: 0, Errors: 0, Skipped: 11

[INFO] ------------------------------------------------------------------------
[INFO] Reactor Summary:
[INFO] 
[INFO] hadoop-mapreduce-client ........................... SUCCESS [2.542s]
[INFO] hadoop-mapreduce-client-core ...................... SUCCESS [51.883s]
[INFO] hadoop-mapreduce-client-common .................... SUCCESS [27.122s]
[INFO] hadoop-mapreduce-client-shuffle ................... SUCCESS [4.503s]
[INFO] hadoop-mapreduce-client-app ....................... SUCCESS [7:06.877s]
[INFO] hadoop-mapreduce-client-hs ........................ SUCCESS [4:43.637s]
[INFO] hadoop-mapreduce-client-jobclient ................. FAILURE [1:37:06.401s]
[INFO] hadoop-mapreduce-client-hs-plugins ................ SKIPPED
[INFO] Apache Hadoop MapReduce Examples .................. SKIPPED
[INFO] hadoop-mapreduce .................................. SKIPPED
[INFO] ------------------------------------------------------------------------
[INFO] BUILD FAILURE
[INFO] ------------------------------------------------------------------------
[INFO] Total time: 1:50:23.998s
[INFO] Finished at: Wed May 28 15:15:54 UTC 2014
[INFO] Final Memory: 28M/69M
[INFO] ------------------------------------------------------------------------
[ERROR] Failed to execute goal org.apache.maven.plugins:maven-surefire-plugin:2.16:test (default-test)
on project hadoop-mapreduce-client-jobclient: There was a timeout or other error in the fork
-> [Help 1]
[ERROR] 
[ERROR] To see the full stack trace of the errors, re-run Maven with the -e switch.
[ERROR] Re-run Maven using the -X switch to enable full debug logging.
[ERROR] 
[ERROR] For more information about the errors and possible solutions, please read the following
articles:
[ERROR] [Help 1] http://cwiki.apache.org/confluence/display/MAVEN/MojoFailureException
[ERROR] 
[ERROR] After correcting the problems, you can resume the build with the command
[ERROR]   mvn <goals> -rf :hadoop-mapreduce-client-jobclient
Build step 'Execute shell' marked build as failure
[FINDBUGS] Skipping publisher since build result is FAILURE
Archiving artifacts
Updating YARN-2105
Updating YARN-2012
Updating HDFS-6411
Updating HDFS-6227
Updating HDFS-6416
Email was triggered for: Failure
Sending email for trigger: Failure



###################################################################################
############################## FAILED TESTS (if any) ##############################
No tests ran.
Mime
  • Unnamed multipart/mixed (inline, None, 0 bytes)
View raw message