hadoop-mapreduce-dev mailing list archives

Site index · List index
Message view « Date » · « Thread »
Top « Date » · « Thread »
From Apache Jenkins Server <jenk...@builds.apache.org>
Subject Hadoop-Mapreduce-trunk - Build # 1613 - Still Failing
Date Tue, 19 Nov 2013 13:27:39 GMT
See https://builds.apache.org/job/Hadoop-Mapreduce-trunk/1613/

###################################################################################
########################## LAST 60 LINES OF THE CONSOLE ###########################
[...truncated 33102 lines...]
Tests run: 4, Failures: 0, Errors: 0, Skipped: 0, Time elapsed: 0.718 sec - in org.apache.hadoop.mapreduce.jobhistory.TestEvents

Results :

Failed tests: 
  TestRMContainerAllocator.testUpdatedNodes:779 null

Tests run: 256, Failures: 1, Errors: 0, Skipped: 0

[INFO] ------------------------------------------------------------------------
[INFO] Reactor Summary:
[INFO] 
[INFO] hadoop-mapreduce-client ........................... SUCCESS [2.385s]
[INFO] hadoop-mapreduce-client-core ...................... SUCCESS [44.204s]
[INFO] hadoop-mapreduce-client-common .................... SUCCESS [25.670s]
[INFO] hadoop-mapreduce-client-shuffle ................... SUCCESS [2.447s]
[INFO] hadoop-mapreduce-client-app ....................... FAILURE [6:41.414s]
[INFO] hadoop-mapreduce-client-hs ........................ SKIPPED
[INFO] hadoop-mapreduce-client-jobclient ................. SKIPPED
[INFO] hadoop-mapreduce-client-hs-plugins ................ SKIPPED
[INFO] Apache Hadoop MapReduce Examples .................. SKIPPED
[INFO] hadoop-mapreduce .................................. SKIPPED
[INFO] ------------------------------------------------------------------------
[INFO] BUILD FAILURE
[INFO] ------------------------------------------------------------------------
[INFO] Total time: 7:57.142s
[INFO] Finished at: Tue Nov 19 13:27:24 UTC 2013
[INFO] Final Memory: 23M/149M
[INFO] ------------------------------------------------------------------------
[ERROR] Failed to execute goal org.apache.maven.plugins:maven-surefire-plugin:2.16:test (default-test)
on project hadoop-mapreduce-client-app: There are test failures.
[ERROR] 
[ERROR] Please refer to /home/jenkins/jenkins-slave/workspace/Hadoop-Mapreduce-trunk/trunk/hadoop-mapreduce-project/hadoop-mapreduce-client/hadoop-mapreduce-client-app/target/surefire-reports
for the individual test results.
[ERROR] -> [Help 1]
[ERROR] 
[ERROR] To see the full stack trace of the errors, re-run Maven with the -e switch.
[ERROR] Re-run Maven using the -X switch to enable full debug logging.
[ERROR] 
[ERROR] For more information about the errors and possible solutions, please read the following
articles:
[ERROR] [Help 1] http://cwiki.apache.org/confluence/display/MAVEN/MojoFailureException
[ERROR] 
[ERROR] After correcting the problems, you can resume the build with the command
[ERROR]   mvn <goals> -rf :hadoop-mapreduce-client-app
Build step 'Execute shell' marked build as failure
[FINDBUGS] Skipping publisher since build result is FAILURE
Archiving artifacts
Updating YARN-1419
Updating YARN-584
Updating HDFS-5428
Updating YARN-709
Updating YARN-1210
Updating HADOOP-10107
Updating HDFS-5073
Updating HDFS-5520
Updating HADOOP-10110
Updating HDFS-5512
Updating HDFS-5393
Updating YARN-674
Email was triggered for: Failure
Sending email for trigger: Failure



###################################################################################
############################## FAILED TESTS (if any) ##############################
No tests ran.
Mime
  • Unnamed multipart/mixed (inline, None, 0 bytes)
View raw message