hadoop-mapreduce-dev mailing list archives

Site index · List index
Message view « Date » · « Thread »
Top « Date » · « Thread »
From Apache Jenkins Server <jenk...@builds.apache.org>
Subject Hadoop-Mapreduce-trunk - Build # 1545 - Still Failing
Date Wed, 11 Sep 2013 14:28:17 GMT
See https://builds.apache.org/job/Hadoop-Mapreduce-trunk/1545/

###################################################################################
########################## LAST 60 LINES OF THE CONSOLE ###########################
[...truncated 32600 lines...]
  TestMiniMRBringup.testBringUp:32 » YarnRuntime org.apache.hadoop.yarn.exceptio...
  TestLazyOutput.testLazyOutput:146 » YarnRuntime java.lang.OutOfMemoryError: un...
  TestJobName>ClusterMapReduceTestCase.setUp:56->ClusterMapReduceTestCase.startCluster:86
» YarnRuntime
  TestJobName>ClusterMapReduceTestCase.setUp:56->ClusterMapReduceTestCase.startCluster:86
» YarnRuntime
  TestMiniMRClientCluster.setup:80 » YarnRuntime org.apache.hadoop.yarn.exceptio...
  TestMiniMRClientCluster.cleanup:93 NullPointer
  TestSpecialCharactersInOutputPath.testJobWithDFS:112 » YarnRuntime java.lang.O...
  TestNoDefaultsJobConf>HadoopTestCase.setUp:156 » YarnRuntime java.lang.OutOfMe...
  TestSocketFactory.testSocketFactory:85->initAndStartMiniMRYarnCluster:112 » YarnRuntime
  TestMRCredentials.setUp:64 » YarnRuntime java.lang.OutOfMemoryError: unable to...
  TestBinaryTokenFile.setUp:208 » YarnRuntime java.lang.OutOfMemoryError: unable...
  TestEncryptedShuffle.encryptedShuffleWithClientCerts:164->encryptedShuffleWithCerts:135->startCluster:104
» YarnRuntime
  TestEncryptedShuffle.encryptedShuffleWithoutClientCerts:169->encryptedShuffleWithCerts:135->startCluster:104
» YarnRuntime

Tests run: 289, Failures: 0, Errors: 22, Skipped: 10

[INFO] ------------------------------------------------------------------------
[INFO] Reactor Summary:
[INFO] 
[INFO] hadoop-mapreduce-client ........................... SUCCESS [1.747s]
[INFO] hadoop-mapreduce-client-core ...................... SUCCESS [37.990s]
[INFO] hadoop-mapreduce-client-common .................... SUCCESS [25.572s]
[INFO] hadoop-mapreduce-client-shuffle ................... SUCCESS [2.320s]
[INFO] hadoop-mapreduce-client-app ....................... SUCCESS [6:22.268s]
[INFO] hadoop-mapreduce-client-hs ........................ SUCCESS [1:44.542s]
[INFO] hadoop-mapreduce-client-jobclient ................. FAILURE [1:01:01.786s]
[INFO] hadoop-mapreduce-client-hs-plugins ................ SKIPPED
[INFO] Apache Hadoop MapReduce Examples .................. SKIPPED
[INFO] hadoop-mapreduce .................................. SKIPPED
[INFO] ------------------------------------------------------------------------
[INFO] BUILD FAILURE
[INFO] ------------------------------------------------------------------------
[INFO] Total time: 1:10:16.883s
[INFO] Finished at: Wed Sep 11 14:28:09 UTC 2013
[INFO] Final Memory: 25M/148M
[INFO] ------------------------------------------------------------------------
[ERROR] Failed to execute goal org.apache.maven.plugins:maven-surefire-plugin:2.16:test (default-test)
on project hadoop-mapreduce-client-jobclient: ExecutionException; nested exception is java.util.concurrent.ExecutionException:
java.lang.RuntimeException: The forked VM terminated without saying properly goodbye. VM crash
or System.exit called ?
[ERROR] Command was/bin/sh -c cd /home/jenkins/jenkins-slave/workspace/Hadoop-Mapreduce-trunk/trunk/hadoop-mapreduce-project/hadoop-mapreduce-client/hadoop-mapreduce-client-jobclient
&& /home/jenkins/tools/java/jdk1.6.0_26/jre/bin/java -Xmx1024m -XX:+HeapDumpOnOutOfMemoryError
-jar /home/jenkins/jenkins-slave/workspace/Hadoop-Mapreduce-trunk/trunk/hadoop-mapreduce-project/hadoop-mapreduce-client/hadoop-mapreduce-client-jobclient/target/surefire/surefirebooter6718219084023565880.jar
/home/jenkins/jenkins-slave/workspace/Hadoop-Mapreduce-trunk/trunk/hadoop-mapreduce-project/hadoop-mapreduce-client/hadoop-mapreduce-client-jobclient/target/surefire/surefire7380229926845527991tmp
/home/jenkins/jenkins-slave/workspace/Hadoop-Mapreduce-trunk/trunk/hadoop-mapreduce-project/hadoop-mapreduce-client/hadoop-mapreduce-client-jobclient/target/surefire/surefire_1062009438849307905625tmp
[ERROR] -> [Help 1]
[ERROR] 
[ERROR] To see the full stack trace of the errors, re-run Maven with the -e switch.
[ERROR] Re-run Maven using the -X switch to enable full debug logging.
[ERROR] 
[ERROR] For more information about the errors and possible solutions, please read the following
articles:
[ERROR] [Help 1] http://cwiki.apache.org/confluence/display/MAVEN/MojoFailureException
[ERROR] 
[ERROR] After correcting the problems, you can resume the build with the command
[ERROR]   mvn <goals> -rf :hadoop-mapreduce-client-jobclient
Build step 'Execute shell' marked build as failure
[FINDBUGS] Skipping publisher since build result is FAILURE
Archiving artifacts
Updating MAPREDUCE-5020
Updating MAPREDUCE-5497
Updating YARN-1025
Updating YARN-1098
Updating HDFS-5085
Updating YARN-1119
Email was triggered for: Failure
Sending email for trigger: Failure



###################################################################################
############################## FAILED TESTS (if any) ##############################
No tests ran.
Mime
  • Unnamed multipart/mixed (inline, None, 0 bytes)
View raw message