hadoop-mapreduce-dev mailing list archives

Site index · List index
Message view « Date » · « Thread »
Top « Date » · « Thread »
From Apache Jenkins Server <jenk...@builds.apache.org>
Subject Hadoop-Mapreduce-trunk - Build # 1384 - Still Failing
Date Tue, 26 Mar 2013 14:04:49 GMT
See https://builds.apache.org/job/Hadoop-Mapreduce-trunk/1384/

###################################################################################
########################## LAST 60 LINES OF THE CONSOLE ###########################
[...truncated 28004 lines...]
Tests in error: 
  testReduceFromPartialMem(org.apache.hadoop.mapred.TestReduceFetchFromPartialMem): Job failed!

Tests run: 447, Failures: 0, Errors: 1, Skipped: 12

[INFO] ------------------------------------------------------------------------
[INFO] Reactor Summary:
[INFO] 
[INFO] hadoop-mapreduce-client ........................... SUCCESS [1.632s]
[INFO] hadoop-mapreduce-client-core ...................... SUCCESS [24.857s]
[INFO] hadoop-mapreduce-client-common .................... SUCCESS [24.381s]
[INFO] hadoop-mapreduce-client-shuffle ................... SUCCESS [1.981s]
[INFO] hadoop-mapreduce-client-app ....................... SUCCESS [5:06.681s]
[INFO] hadoop-mapreduce-client-hs ........................ SUCCESS [1:12.065s]
[INFO] hadoop-mapreduce-client-jobclient ................. FAILURE [43:00.720s]
[INFO] hadoop-mapreduce-client-hs-plugins ................ SKIPPED
[INFO] Apache Hadoop MapReduce Examples .................. SKIPPED
[INFO] hadoop-mapreduce .................................. SKIPPED
[INFO] ------------------------------------------------------------------------
[INFO] BUILD FAILURE
[INFO] ------------------------------------------------------------------------
[INFO] Total time: 50:12.970s
[INFO] Finished at: Tue Mar 26 14:04:37 UTC 2013
[INFO] Final Memory: 19M/156M
[INFO] ------------------------------------------------------------------------
[ERROR] Failed to execute goal org.apache.maven.plugins:maven-surefire-plugin:2.12.3:test
(default-test) on project hadoop-mapreduce-client-jobclient: There are test failures.
[ERROR] 
[ERROR] Please refer to /home/jenkins/jenkins-slave/workspace/Hadoop-Mapreduce-trunk/trunk/hadoop-mapreduce-project/hadoop-mapreduce-client/hadoop-mapreduce-client-jobclient/target/surefire-reports
for the individual test results.
[ERROR] -> [Help 1]
[ERROR] 
[ERROR] To see the full stack trace of the errors, re-run Maven with the -e switch.
[ERROR] Re-run Maven using the -X switch to enable full debug logging.
[ERROR] 
[ERROR] For more information about the errors and possible solutions, please read the following
articles:
[ERROR] [Help 1] http://cwiki.apache.org/confluence/display/MAVEN/MojoFailureException
[ERROR] 
[ERROR] After correcting the problems, you can resume the build with the command
[ERROR]   mvn <goals> -rf :hadoop-mapreduce-client-jobclient
Build step 'Execute shell' marked build as failure
[FINDBUGS] Skipping publisher since build result is FAILURE
Archiving artifacts
Updating YARN-71
Updating HADOOP-9261
Updating YARN-109
Updating HADOOP-9227
Updating YARN-469
Updating YARN-498
Updating HADOOP-9228
Updating MAPREDUCE-5062
Updating YARN-497
Updating HADOOP-9433
Updating YARN-378
Updating YARN-439
Updating HDFS-4598
Updating HADOOP-9265
Updating HADOOP-9259
Updating HADOOP-9258
Email was triggered for: Failure
Sending email for trigger: Failure



###################################################################################
############################## FAILED TESTS (if any) ##############################
No tests ran.
Mime
  • Unnamed multipart/mixed (inline, None, 0 bytes)
View raw message