hadoop-mapreduce-dev mailing list archives

Site index · List index
Message view « Date » · « Thread »
Top « Date » · « Thread »
From Apache Jenkins Server <jenk...@builds.apache.org>
Subject Hadoop-Mapreduce-trunk - Build # 1249 - Still Failing
Date Wed, 07 Nov 2012 14:01:47 GMT
See https://builds.apache.org/job/Hadoop-Mapreduce-trunk/1249/

###################################################################################
########################## LAST 60 LINES OF THE CONSOLE ###########################
[...truncated 30816 lines...]
Tests run: 4, Failures: 0, Errors: 0, Skipped: 0, Time elapsed: 0.425 sec
Running org.apache.hadoop.mapreduce.lib.partition.TestMRKeyFieldBasedPartitioner
Tests run: 1, Failures: 0, Errors: 0, Skipped: 0, Time elapsed: 0.388 sec
Running org.apache.hadoop.mapreduce.TestChild
Tests run: 1, Failures: 0, Errors: 0, Skipped: 0, Time elapsed: 58.74 sec
Running org.apache.hadoop.mapreduce.filecache.TestURIFragments
Tests run: 1, Failures: 0, Errors: 0, Skipped: 0, Time elapsed: 0.06 sec
Running org.apache.hadoop.mapreduce.TestMapReduce
Tests run: 1, Failures: 0, Errors: 0, Skipped: 0, Time elapsed: 4.524 sec

Results :

Failed tests:   testMR(org.apache.hadoop.mapred.TestClusterMRNotification): expected:<6>
but was:<4>

Tests run: 439, Failures: 1, Errors: 0, Skipped: 14

[INFO] ------------------------------------------------------------------------
[INFO] Reactor Summary:
[INFO] 
[INFO] hadoop-mapreduce-client ........................... SUCCESS [2.072s]
[INFO] hadoop-mapreduce-client-core ...................... SUCCESS [18.288s]
[INFO] hadoop-mapreduce-client-common .................... SUCCESS [22.311s]
[INFO] hadoop-mapreduce-client-shuffle ................... SUCCESS [1.070s]
[INFO] hadoop-mapreduce-client-app ....................... SUCCESS [4:33.891s]
[INFO] hadoop-mapreduce-client-hs ........................ SUCCESS [1:10.630s]
[INFO] hadoop-mapreduce-client-jobclient ................. FAILURE [39:38.480s]
[INFO] Apache Hadoop MapReduce Examples .................. SKIPPED
[INFO] hadoop-mapreduce .................................. SKIPPED
[INFO] ------------------------------------------------------------------------
[INFO] BUILD FAILURE
[INFO] ------------------------------------------------------------------------
[INFO] Total time: 46:07.295s
[INFO] Finished at: Wed Nov 07 14:01:39 UTC 2012
[INFO] Final Memory: 20M/145M
[INFO] ------------------------------------------------------------------------
[ERROR] Failed to execute goal org.apache.maven.plugins:maven-surefire-plugin:2.12.3:test
(default-test) on project hadoop-mapreduce-client-jobclient: ExecutionException; nested exception
is java.util.concurrent.ExecutionException: java.lang.RuntimeException: The forked VM terminated
without saying properly goodbye. VM crash or System.exit called ? -> [Help 1]
[ERROR] 
[ERROR] To see the full stack trace of the errors, re-run Maven with the -e switch.
[ERROR] Re-run Maven using the -X switch to enable full debug logging.
[ERROR] 
[ERROR] For more information about the errors and possible solutions, please read the following
articles:
[ERROR] [Help 1] http://cwiki.apache.org/confluence/display/MAVEN/MojoExecutionException
[ERROR] 
[ERROR] After correcting the problems, you can resume the build with the command
[ERROR]   mvn <goals> -rf :hadoop-mapreduce-client-jobclient
Build step 'Execute shell' marked build as failure
[FINDBUGS] Skipping publisher since build result is FAILURE
Archiving artifacts
Updating HDFS-4152
Updating HDFS-4075
Updating HDFS-4153
Updating HDFS-1331
Updating HADOOP-9004
Updating HADOOP-9012
Updating YARN-202
Updating HDFS-4155
Updating HDFS-3979
Email was triggered for: Failure
Sending email for trigger: Failure



###################################################################################
############################## FAILED TESTS (if any) ##############################
No tests ran.
Mime
  • Unnamed multipart/mixed (inline, None, 0 bytes)
View raw message