hadoop-mapreduce-dev mailing list archives

Site index · List index
Message view « Date » · « Thread »
Top « Date » · « Thread »
From Apache Jenkins Server <jenk...@builds.apache.org>
Subject Hadoop-Mapreduce-trunk - Build # 1250 - Still Failing
Date Thu, 08 Nov 2012 14:02:30 GMT
See https://builds.apache.org/job/Hadoop-Mapreduce-trunk/1250/

###################################################################################
########################## LAST 60 LINES OF THE CONSOLE ###########################
[...truncated 30839 lines...]
Running org.apache.hadoop.mapreduce.TestChild
Tests run: 1, Failures: 0, Errors: 0, Skipped: 0, Time elapsed: 58.779 sec
Running org.apache.hadoop.mapreduce.filecache.TestURIFragments
Tests run: 1, Failures: 0, Errors: 0, Skipped: 0, Time elapsed: 0.059 sec
Running org.apache.hadoop.mapreduce.TestMapReduce
Tests run: 1, Failures: 0, Errors: 0, Skipped: 0, Time elapsed: 4.555 sec

Results :

Failed tests:   testMR(org.apache.hadoop.mapred.TestClusterMRNotification): expected:<6>
but was:<4>

Tests run: 441, Failures: 1, Errors: 0, Skipped: 14

[INFO] ------------------------------------------------------------------------
[INFO] Reactor Summary:
[INFO] 
[INFO] hadoop-mapreduce-client ........................... SUCCESS [4.068s]
[INFO] hadoop-mapreduce-client-core ...................... SUCCESS [18.104s]
[INFO] hadoop-mapreduce-client-common .................... SUCCESS [22.113s]
[INFO] hadoop-mapreduce-client-shuffle ................... SUCCESS [1.058s]
[INFO] hadoop-mapreduce-client-app ....................... SUCCESS [4:30.537s]
[INFO] hadoop-mapreduce-client-hs ........................ SUCCESS [1:09.285s]
[INFO] hadoop-mapreduce-client-jobclient ................. FAILURE [40:13.732s]
[INFO] Apache Hadoop MapReduce Examples .................. SKIPPED
[INFO] hadoop-mapreduce .................................. SKIPPED
[INFO] ------------------------------------------------------------------------
[INFO] BUILD FAILURE
[INFO] ------------------------------------------------------------------------
[INFO] Total time: 46:39.464s
[INFO] Finished at: Thu Nov 08 14:02:21 UTC 2012
[INFO] Final Memory: 20M/150M
[INFO] ------------------------------------------------------------------------
[ERROR] Failed to execute goal org.apache.maven.plugins:maven-surefire-plugin:2.12.3:test
(default-test) on project hadoop-mapreduce-client-jobclient: There are test failures.
[ERROR] 
[ERROR] Please refer to /home/jenkins/jenkins-slave/workspace/Hadoop-Mapreduce-trunk/trunk/hadoop-mapreduce-project/hadoop-mapreduce-client/hadoop-mapreduce-client-jobclient/target/surefire-reports
for the individual test results.
[ERROR] -> [Help 1]
[ERROR] 
[ERROR] To see the full stack trace of the errors, re-run Maven with the -e switch.
[ERROR] Re-run Maven using the -X switch to enable full debug logging.
[ERROR] 
[ERROR] For more information about the errors and possible solutions, please read the following
articles:
[ERROR] [Help 1] http://cwiki.apache.org/confluence/display/MAVEN/MojoFailureException
[ERROR] 
[ERROR] After correcting the problems, you can resume the build with the command
[ERROR]   mvn <goals> -rf :hadoop-mapreduce-client-jobclient
Build step 'Execute shell' marked build as failure
[FINDBUGS] Skipping publisher since build result is FAILURE
Archiving artifacts
Updating MAPREDUCE-4777
Updating HDFS-3625
Updating HADOOP-9015
Updating HADOOP-9014
Updating HADOOP-9013
Updating YARN-169
Updating YARN-201
Updating HADOOP-8589
Updating HDFS-4138
Email was triggered for: Failure
Sending email for trigger: Failure



###################################################################################
############################## FAILED TESTS (if any) ##############################
No tests ran.
Mime
  • Unnamed multipart/mixed (inline, None, 0 bytes)
View raw message