hadoop-mapreduce-dev mailing list archives

Site index · List index
Message view « Date » · « Thread »
Top « Date » · « Thread »
From Apache Jenkins Server <jenk...@builds.apache.org>
Subject Hadoop-Mapreduce-trunk - Build # 1267 - Still Failing
Date Sat, 24 Nov 2012 13:23:15 GMT
See https://builds.apache.org/job/Hadoop-Mapreduce-trunk/1267/

###################################################################################
########################## LAST 60 LINES OF THE CONSOLE ###########################
[...truncated 27926 lines...]
Running org.apache.hadoop.mapreduce.v2.app.webapp.TestAMWebServicesJobs
Tests run: 21, Failures: 0, Errors: 0, Skipped: 0, Time elapsed: 8.232 sec
Running org.apache.hadoop.mapreduce.v2.app.webapp.TestAMWebServices
Tests run: 11, Failures: 0, Errors: 0, Skipped: 0, Time elapsed: 5.502 sec
Running org.apache.hadoop.mapreduce.v2.app.webapp.TestAMWebServicesAttempts
Tests run: 15, Failures: 0, Errors: 0, Skipped: 0, Time elapsed: 7.573 sec
Running org.apache.hadoop.mapreduce.v2.app.webapp.TestAMWebServicesJobConf
Tests run: 4, Failures: 0, Errors: 0, Skipped: 0, Time elapsed: 4.382 sec
Running org.apache.hadoop.mapreduce.v2.app.webapp.TestAMWebServicesTasks
Tests run: 20, Failures: 0, Errors: 0, Skipped: 0, Time elapsed: 7.958 sec
Running org.apache.hadoop.mapreduce.v2.app.TestKill
Tests run: 4, Failures: 0, Errors: 0, Skipped: 0, Time elapsed: 7.418 sec
Running org.apache.hadoop.mapreduce.v2.app.TestStagingCleanup
Tests run: 4, Failures: 0, Errors: 0, Skipped: 0, Time elapsed: 11.969 sec
Running org.apache.hadoop.mapreduce.v2.app.launcher.TestContainerLauncherImpl
Tests run: 3, Failures: 0, Errors: 0, Skipped: 0, Time elapsed: 1.545 sec
Running org.apache.hadoop.mapreduce.v2.app.launcher.TestContainerLauncher
Tests run: 3, Failures: 0, Errors: 0, Skipped: 0, Time elapsed: 12.925 sec
Running org.apache.hadoop.mapreduce.jobhistory.TestJobHistoryEventHandler
Tests run: 5, Failures: 0, Errors: 0, Skipped: 0, Time elapsed: 10.072 sec

Results :

Tests run: 180, Failures: 0, Errors: 0, Skipped: 0

[INFO] ------------------------------------------------------------------------
[INFO] Reactor Summary:
[INFO] 
[INFO] hadoop-mapreduce-client ........................... SUCCESS [1.693s]
[INFO] hadoop-mapreduce-client-core ...................... SUCCESS [17.905s]
[INFO] hadoop-mapreduce-client-common .................... SUCCESS [21.981s]
[INFO] hadoop-mapreduce-client-shuffle ................... SUCCESS [1.638s]
[INFO] hadoop-mapreduce-client-app ....................... FAILURE [4:42.109s]
[INFO] hadoop-mapreduce-client-hs ........................ SKIPPED
[INFO] hadoop-mapreduce-client-jobclient ................. SKIPPED
[INFO] Apache Hadoop MapReduce Examples .................. SKIPPED
[INFO] hadoop-mapreduce .................................. SKIPPED
[INFO] ------------------------------------------------------------------------
[INFO] BUILD FAILURE
[INFO] ------------------------------------------------------------------------
[INFO] Total time: 5:25.885s
[INFO] Finished at: Sat Nov 24 13:23:10 UTC 2012
[INFO] Final Memory: 20M/196M
[INFO] ------------------------------------------------------------------------
[ERROR] Failed to execute goal org.apache.maven.plugins:maven-surefire-plugin:2.12.3:test
(default-test) on project hadoop-mapreduce-client-app: ExecutionException; nested exception
is java.util.concurrent.ExecutionException: java.lang.RuntimeException: The forked VM terminated
without saying properly goodbye. VM crash or System.exit called ? -> [Help 1]
[ERROR] 
[ERROR] To see the full stack trace of the errors, re-run Maven with the -e switch.
[ERROR] Re-run Maven using the -X switch to enable full debug logging.
[ERROR] 
[ERROR] For more information about the errors and possible solutions, please read the following
articles:
[ERROR] [Help 1] http://cwiki.apache.org/confluence/display/MAVEN/MojoExecutionException
[ERROR] 
[ERROR] After correcting the problems, you can resume the build with the command
[ERROR]   mvn <goals> -rf :hadoop-mapreduce-client-app
Build step 'Execute shell' marked build as failure
[FINDBUGS] Skipping publisher since build result is FAILURE
Archiving artifacts
Email was triggered for: Failure
Sending email for trigger: Failure



###################################################################################
############################## FAILED TESTS (if any) ##############################
No tests ran.
Mime
  • Unnamed multipart/mixed (inline, None, 0 bytes)
View raw message