hadoop-mapreduce-dev mailing list archives

Site index · List index
Message view « Date » · « Thread »
Top « Date » · « Thread »
From Apache Jenkins Server <jenk...@builds.apache.org>
Subject Hadoop-Mapreduce-trunk - Build # 1248 - Still Failing
Date Tue, 06 Nov 2012 14:02:13 GMT
See https://builds.apache.org/job/Hadoop-Mapreduce-trunk/1248/

###################################################################################
########################## LAST 60 LINES OF THE CONSOLE ###########################
[...truncated 30846 lines...]
Running org.apache.hadoop.mapreduce.lib.partition.TestBinaryPartitioner
Tests run: 4, Failures: 0, Errors: 0, Skipped: 0, Time elapsed: 0.424 sec
Running org.apache.hadoop.mapreduce.lib.partition.TestMRKeyFieldBasedPartitioner
Tests run: 1, Failures: 0, Errors: 0, Skipped: 0, Time elapsed: 0.389 sec
Running org.apache.hadoop.mapreduce.TestChild
Tests run: 1, Failures: 0, Errors: 0, Skipped: 0, Time elapsed: 59.741 sec
Running org.apache.hadoop.mapreduce.filecache.TestURIFragments
Tests run: 1, Failures: 0, Errors: 0, Skipped: 0, Time elapsed: 0.06 sec
Running org.apache.hadoop.mapreduce.TestMapReduce
Tests run: 1, Failures: 0, Errors: 0, Skipped: 0, Time elapsed: 4.529 sec

Results :

Failed tests:   testMR(org.apache.hadoop.mapred.TestClusterMRNotification): expected:<6>
but was:<4>

Tests run: 441, Failures: 1, Errors: 0, Skipped: 14

[INFO] ------------------------------------------------------------------------
[INFO] Reactor Summary:
[INFO] 
[INFO] hadoop-mapreduce-client ........................... SUCCESS [3.224s]
[INFO] hadoop-mapreduce-client-core ...................... SUCCESS [17.816s]
[INFO] hadoop-mapreduce-client-common .................... SUCCESS [22.077s]
[INFO] hadoop-mapreduce-client-shuffle ................... SUCCESS [1.060s]
[INFO] hadoop-mapreduce-client-app ....................... SUCCESS [4:35.037s]
[INFO] hadoop-mapreduce-client-hs ........................ SUCCESS [1:11.896s]
[INFO] hadoop-mapreduce-client-jobclient ................. FAILURE [39:58.970s]
[INFO] Apache Hadoop MapReduce Examples .................. SKIPPED
[INFO] hadoop-mapreduce .................................. SKIPPED
[INFO] ------------------------------------------------------------------------
[INFO] BUILD FAILURE
[INFO] ------------------------------------------------------------------------
[INFO] Total time: 46:30.622s
[INFO] Finished at: Tue Nov 06 14:02:06 UTC 2012
[INFO] Final Memory: 20M/127M
[INFO] ------------------------------------------------------------------------
[ERROR] Failed to execute goal org.apache.maven.plugins:maven-surefire-plugin:2.12.3:test
(default-test) on project hadoop-mapreduce-client-jobclient: There are test failures.
[ERROR] 
[ERROR] Please refer to /home/jenkins/jenkins-slave/workspace/Hadoop-Mapreduce-trunk/trunk/hadoop-mapreduce-project/hadoop-mapreduce-client/hadoop-mapreduce-client-jobclient/target/surefire-reports
for the individual test results.
[ERROR] -> [Help 1]
[ERROR] 
[ERROR] To see the full stack trace of the errors, re-run Maven with the -e switch.
[ERROR] Re-run Maven using the -X switch to enable full debug logging.
[ERROR] 
[ERROR] For more information about the errors and possible solutions, please read the following
articles:
[ERROR] [Help 1] http://cwiki.apache.org/confluence/display/MAVEN/MojoFailureException
[ERROR] 
[ERROR] After correcting the problems, you can resume the build with the command
[ERROR]   mvn <goals> -rf :hadoop-mapreduce-client-jobclient
Build step 'Execute shell' marked build as failure
[FINDBUGS] Skipping publisher since build result is FAILURE
Archiving artifacts
Updating HADOOP-9009
Updating HDFS-4151
Updating HADOOP-9010
Updating MAPREDUCE-4771
Updating HDFS-4046
Email was triggered for: Failure
Sending email for trigger: Failure



###################################################################################
############################## FAILED TESTS (if any) ##############################
No tests ran.
Mime
  • Unnamed multipart/mixed (inline, None, 0 bytes)
View raw message