hadoop-mapreduce-dev mailing list archives

Site index · List index
Message view « Date » · « Thread »
Top « Date » · « Thread »
From Apache Jenkins Server <jenk...@builds.apache.org>
Subject Hadoop-Mapreduce-trunk - Build # 1213 - Still Failing
Date Mon, 01 Oct 2012 13:15:54 GMT
See https://builds.apache.org/job/Hadoop-Mapreduce-trunk/1213/

###################################################################################
########################## LAST 60 LINES OF THE CONSOLE ###########################
[...truncated 30155 lines...]
Running org.apache.hadoop.mapreduce.v2.api.records.TestIds
Tests run: 3, Failures: 0, Errors: 0, Skipped: 0, Time elapsed: 0.247 sec
Running org.apache.hadoop.mapreduce.v2.jobhistory.TestFileNameIndexUtils
Tests run: 6, Failures: 0, Errors: 0, Skipped: 0, Time elapsed: 0.255 sec
Running org.apache.hadoop.mapreduce.v2.util.TestMRApps
Tests run: 18, Failures: 0, Errors: 0, Skipped: 0, Time elapsed: 1.224 sec
Running org.apache.hadoop.mapreduce.v2.TestRecordFactory
Tests run: 1, Failures: 0, Errors: 0, Skipped: 0, Time elapsed: 0.169 sec
Running org.apache.hadoop.mapreduce.TestTypeConverter
Tests run: 5, Failures: 0, Errors: 0, Skipped: 0, Time elapsed: 0.484 sec

Results :

Tests in error: 
  testNewApis(org.apache.hadoop.mapred.TestLocalModeWithNewApis): No valid local directories
in property: mapreduce.cluster.local.dir
  testLocalJobRunner(org.apache.hadoop.mapred.TestMRWithDistributedCache): No valid local
directories in property: mapreduce.cluster.local.dir
  testGetRunningJobFromJobClient(org.apache.hadoop.mapred.TestJobClientGetJob): No valid local
directories in property: mapreduce.cluster.local.dir

Tests run: 40, Failures: 0, Errors: 3, Skipped: 0

[INFO] ------------------------------------------------------------------------
[INFO] Reactor Summary:
[INFO] 
[INFO] hadoop-mapreduce-client ........................... SUCCESS [2.114s]
[INFO] hadoop-mapreduce-client-core ...................... SUCCESS [16.016s]
[INFO] hadoop-mapreduce-client-common .................... FAILURE [13.759s]
[INFO] hadoop-mapreduce-client-shuffle ................... SKIPPED
[INFO] hadoop-mapreduce-client-app ....................... SKIPPED
[INFO] hadoop-mapreduce-client-hs ........................ SKIPPED
[INFO] hadoop-mapreduce-client-jobclient ................. SKIPPED
[INFO] Apache Hadoop MapReduce Examples .................. SKIPPED
[INFO] hadoop-mapreduce .................................. SKIPPED
[INFO] ------------------------------------------------------------------------
[INFO] BUILD FAILURE
[INFO] ------------------------------------------------------------------------
[INFO] Total time: 32.441s
[INFO] Finished at: Mon Oct 01 13:15:49 UTC 2012
[INFO] Final Memory: 22M/274M
[INFO] ------------------------------------------------------------------------
[ERROR] Failed to execute goal org.apache.maven.plugins:maven-surefire-plugin:2.12:test (default-test)
on project hadoop-mapreduce-client-common: There are test failures.
[ERROR] 
[ERROR] Please refer to /home/jenkins/jenkins-slave/workspace/Hadoop-Mapreduce-trunk/trunk/hadoop-mapreduce-project/hadoop-mapreduce-client/hadoop-mapreduce-client-common/target/surefire-reports
for the individual test results.
[ERROR] -> [Help 1]
[ERROR] 
[ERROR] To see the full stack trace of the errors, re-run Maven with the -e switch.
[ERROR] Re-run Maven using the -X switch to enable full debug logging.
[ERROR] 
[ERROR] For more information about the errors and possible solutions, please read the following
articles:
[ERROR] [Help 1] http://cwiki.apache.org/confluence/display/MAVEN/MojoFailureException
[ERROR] 
[ERROR] After correcting the problems, you can resume the build with the command
[ERROR]   mvn <goals> -rf :hadoop-mapreduce-client-common
Build step 'Execute shell' marked build as failure
[FINDBUGS] Skipping publisher since build result is FAILURE
Archiving artifacts
Updating MAPREDUCE-4681
Updating HDFS-3910
Email was triggered for: Failure
Sending email for trigger: Failure



###################################################################################
############################## FAILED TESTS (if any) ##############################
No tests ran.
Mime
  • Unnamed multipart/mixed (inline, None, 0 bytes)
View raw message