hadoop-mapreduce-dev mailing list archives

Site index · List index
Message view « Date » · « Thread »
Top « Date » · « Thread »
From Apache Jenkins Server <jenk...@builds.apache.org>
Subject Hadoop-Mapreduce-trunk - Build # 1223 - Failure
Date Thu, 11 Oct 2012 13:21:11 GMT
See https://builds.apache.org/job/Hadoop-Mapreduce-trunk/1223/

###################################################################################
########################## LAST 60 LINES OF THE CONSOLE ###########################
[...truncated 29327 lines...]
Tests run: 3, Failures: 0, Errors: 0, Skipped: 0, Time elapsed: 1.5 sec
Running org.apache.hadoop.mapreduce.v2.app.launcher.TestContainerLauncher
Tests run: 3, Failures: 0, Errors: 0, Skipped: 0, Time elapsed: 12.867 sec
Running org.apache.hadoop.mapreduce.jobhistory.TestJobHistoryEventHandler
Tests run: 5, Failures: 0, Errors: 0, Skipped: 0, Time elapsed: 10.025 sec

Results :

Failed tests:   testMultipleCrashes(org.apache.hadoop.mapreduce.v2.app.TestRecovery): Reduce
Task state not correct expected:<RUNNING> but was:<SCHEDULED>
  testOutputRecovery(org.apache.hadoop.mapreduce.v2.app.TestRecovery): Task state is not correct
(timedout) expected:<SUCCEEDED> but was:<RUNNING>
  testOutputRecoveryMapsOnly(org.apache.hadoop.mapreduce.v2.app.TestRecovery): Task state
is not correct (timedout) expected:<SUCCEEDED> but was:<RUNNING>

Tests run: 175, Failures: 3, Errors: 0, Skipped: 0

[INFO] ------------------------------------------------------------------------
[INFO] Reactor Summary:
[INFO] 
[INFO] hadoop-mapreduce-client ........................... SUCCESS [2.084s]
[INFO] hadoop-mapreduce-client-core ...................... SUCCESS [16.461s]
[INFO] hadoop-mapreduce-client-common .................... SUCCESS [21.824s]
[INFO] hadoop-mapreduce-client-shuffle ................... SUCCESS [1.061s]
[INFO] hadoop-mapreduce-client-app ....................... FAILURE [4:34.772s]
[INFO] hadoop-mapreduce-client-hs ........................ SKIPPED
[INFO] hadoop-mapreduce-client-jobclient ................. SKIPPED
[INFO] Apache Hadoop MapReduce Examples .................. SKIPPED
[INFO] hadoop-mapreduce .................................. SKIPPED
[INFO] ------------------------------------------------------------------------
[INFO] BUILD FAILURE
[INFO] ------------------------------------------------------------------------
[INFO] Total time: 5:16.755s
[INFO] Finished at: Thu Oct 11 13:21:04 UTC 2012
[INFO] Final Memory: 22M/243M
[INFO] ------------------------------------------------------------------------
[ERROR] Failed to execute goal org.apache.maven.plugins:maven-surefire-plugin:2.12.3:test
(default-test) on project hadoop-mapreduce-client-app: There are test failures.
[ERROR] 
[ERROR] Please refer to /home/jenkins/jenkins-slave/workspace/Hadoop-Mapreduce-trunk/trunk/hadoop-mapreduce-project/hadoop-mapreduce-client/hadoop-mapreduce-client-app/target/surefire-reports
for the individual test results.
[ERROR] -> [Help 1]
[ERROR] 
[ERROR] To see the full stack trace of the errors, re-run Maven with the -e switch.
[ERROR] Re-run Maven using the -X switch to enable full debug logging.
[ERROR] 
[ERROR] For more information about the errors and possible solutions, please read the following
articles:
[ERROR] [Help 1] http://cwiki.apache.org/confluence/display/MAVEN/MojoFailureException
[ERROR] 
[ERROR] After correcting the problems, you can resume the build with the command
[ERROR]   mvn <goals> -rf :hadoop-mapreduce-client-app
Build step 'Execute shell' marked build as failure
[FINDBUGS] Skipping publisher since build result is FAILURE
Archiving artifacts
Updating HDFS-3824
Updating HADOOP-8878
Updating HDFS-3077
Updating YARN-146
Updating HDFS-3224
Updating HDFS-4020
Updating HDFS-4021
Updating HADOOP-8913
Email was triggered for: Failure
Sending email for trigger: Failure



###################################################################################
############################## FAILED TESTS (if any) ##############################
No tests ran.
Mime
  • Unnamed multipart/mixed (inline, None, 0 bytes)
View raw message