hadoop-mapreduce-dev mailing list archives

Site index · List index
Message view « Date » · « Thread »
Top « Date » · « Thread »
From Apache Jenkins Server <jenk...@builds.apache.org>
Subject Hadoop-Mapreduce-trunk - Build # 1169 - Still Failing
Date Fri, 17 Aug 2012 13:56:07 GMT
See https://builds.apache.org/job/Hadoop-Mapreduce-trunk/1169/

###################################################################################
########################## LAST 60 LINES OF THE CONSOLE ###########################
[...truncated 30239 lines...]
Tests run: 1, Failures: 0, Errors: 0, Skipped: 0, Time elapsed: 0.351 sec
Running org.apache.hadoop.mapreduce.TestChild
Tests run: 1, Failures: 0, Errors: 0, Skipped: 0, Time elapsed: 53.343 sec
Running org.apache.hadoop.mapreduce.filecache.TestURIFragments
Tests run: 1, Failures: 0, Errors: 0, Skipped: 0, Time elapsed: 0.061 sec
Running org.apache.hadoop.mapreduce.TestMapReduce
Tests run: 1, Failures: 0, Errors: 0, Skipped: 0, Time elapsed: 4.466 sec

Results :

Failed tests:   testForEmptyFile(org.apache.hadoop.mapreduce.lib.input.TestCombineFileInputFormat):
expected:<0> but was:<1>

Tests run: 384, Failures: 1, Errors: 0, Skipped: 14

[INFO] ------------------------------------------------------------------------
[INFO] Reactor Summary:
[INFO] 
[INFO] hadoop-mapreduce-client ........................... SUCCESS [1.981s]
[INFO] hadoop-mapreduce-client-core ...................... SUCCESS [1:34.215s]
[INFO] hadoop-mapreduce-client-common .................... SUCCESS [21.173s]
[INFO] hadoop-mapreduce-client-shuffle ................... SUCCESS [1.076s]
[INFO] hadoop-mapreduce-client-app ....................... SUCCESS [4:27.275s]
[INFO] hadoop-mapreduce-client-hs ........................ SUCCESS [1:05.510s]
[INFO] hadoop-mapreduce-client-jobclient ................. FAILURE [34:40.136s]
[INFO] Apache Hadoop MapReduce Examples .................. SKIPPED
[INFO] hadoop-mapreduce .................................. SKIPPED
[INFO] ------------------------------------------------------------------------
[INFO] BUILD FAILURE
[INFO] ------------------------------------------------------------------------
[INFO] Total time: 42:11.911s
[INFO] Finished at: Fri Aug 17 13:55:59 UTC 2012
[INFO] Final Memory: 20M/143M
[INFO] ------------------------------------------------------------------------
[ERROR] Failed to execute goal org.apache.maven.plugins:maven-surefire-plugin:2.12:test (default-test)
on project hadoop-mapreduce-client-jobclient: There are test failures.
[ERROR] 
[ERROR] Please refer to /home/jenkins/jenkins-slave/workspace/Hadoop-Mapreduce-trunk/trunk/hadoop-mapreduce-project/hadoop-mapreduce-client/hadoop-mapreduce-client-jobclient/target/surefire-reports
for the individual test results.
[ERROR] -> [Help 1]
[ERROR] 
[ERROR] To see the full stack trace of the errors, re-run Maven with the -e switch.
[ERROR] Re-run Maven using the -X switch to enable full debug logging.
[ERROR] 
[ERROR] For more information about the errors and possible solutions, please read the following
articles:
[ERROR] [Help 1] http://cwiki.apache.org/confluence/display/MAVEN/MojoFailureException
[ERROR] 
[ERROR] After correcting the problems, you can resume the build with the command
[ERROR]   mvn <goals> -rf :hadoop-mapreduce-client-jobclient
Build step 'Execute shell' marked build as failure
[FINDBUGS] Skipping publisher since build result is FAILURE
Archiving artifacts
Updating HDFS-2421
Updating HDFS-3788
Updating HADOOP-8390
Updating MAPREDUCE-4562
Updating HDFS-3808
Updating HDFS-2963
Updating HADOOP-8654
Updating HDFS-3194
Email was triggered for: Failure
Sending email for trigger: Failure



###################################################################################
############################## FAILED TESTS (if any) ##############################
No tests ran.
Mime
  • Unnamed multipart/mixed (inline, None, 0 bytes)
View raw message