hadoop-mapreduce-dev mailing list archives

Site index · List index
Message view « Date » · « Thread »
Top « Date » · « Thread »
From Apache Jenkins Server <jenk...@builds.apache.org>
Subject Hadoop-Mapreduce-trunk - Build # 1159 - Still Failing
Date Mon, 06 Aug 2012 14:04:06 GMT
See https://builds.apache.org/job/Hadoop-Mapreduce-trunk/1159/

###################################################################################
########################## LAST 60 LINES OF THE CONSOLE ###########################
[...truncated 30989 lines...]
Running org.apache.hadoop.mapreduce.TestMapReduce
Tests run: 1, Failures: 0, Errors: 0, Skipped: 0, Time elapsed: 4.466 sec

Results :

Failed tests:   testForEmptyFile(org.apache.hadoop.mapreduce.lib.input.TestCombineFileInputFormat):
expected:<0> but was:<1>

Tests run: 384, Failures: 1, Errors: 0, Skipped: 14

[INFO] ------------------------------------------------------------------------
[INFO] Reactor Summary:
[INFO] 
[INFO] hadoop-yarn ....................................... SUCCESS [1.837s]
[INFO] hadoop-yarn-api ................................... SUCCESS [8.696s]
[INFO] hadoop-yarn-common ................................ SUCCESS [29.666s]
[INFO] hadoop-yarn-server ................................ SUCCESS [0.112s]
[INFO] hadoop-yarn-server-common ......................... SUCCESS [2.562s]
[INFO] hadoop-yarn-server-nodemanager .................... SUCCESS [2:24.256s]
[INFO] hadoop-yarn-server-web-proxy ...................... SUCCESS [1.263s]
[INFO] hadoop-yarn-server-resourcemanager ................ SUCCESS [3:36.013s]
[INFO] hadoop-yarn-server-tests .......................... SUCCESS [40.780s]
[INFO] hadoop-mapreduce-client ........................... SUCCESS [0.064s]
[INFO] hadoop-mapreduce-client-core ...................... SUCCESS [1:44.535s]
[INFO] hadoop-yarn-applications .......................... SUCCESS [0.087s]
[INFO] hadoop-yarn-applications-distributedshell ......... SUCCESS [12.222s]
[INFO] hadoop-yarn-applications-unmanaged-am-launcher .... SUCCESS [9.839s]
[INFO] hadoop-yarn-site .................................. SUCCESS [0.146s]
[INFO] hadoop-mapreduce-client-common .................... SUCCESS [18.783s]
[INFO] hadoop-mapreduce-client-shuffle ................... SUCCESS [1.008s]
[INFO] hadoop-mapreduce-client-app ....................... SUCCESS [4:25.516s]
[INFO] hadoop-mapreduce-client-hs ........................ SUCCESS [1:06.539s]
[INFO] hadoop-mapreduce-client-jobclient ................. FAILURE [34:52.986s]
[INFO] Apache Hadoop MapReduce Examples .................. SKIPPED
[INFO] hadoop-mapreduce .................................. SKIPPED
[INFO] ------------------------------------------------------------------------
[INFO] BUILD FAILURE
[INFO] ------------------------------------------------------------------------
[INFO] Total time: 50:18.128s
[INFO] Finished at: Mon Aug 06 14:03:59 UTC 2012
[INFO] Final Memory: 27M/255M
[INFO] ------------------------------------------------------------------------
[ERROR] Failed to execute goal org.apache.maven.plugins:maven-surefire-plugin:2.12:test (default-test)
on project hadoop-mapreduce-client-jobclient: There are test failures.
[ERROR] 
[ERROR] Please refer to /home/jenkins/jenkins-slave/workspace/Hadoop-Mapreduce-trunk/trunk/hadoop-mapreduce-project/hadoop-mapreduce-client/hadoop-mapreduce-client-jobclient/target/surefire-reports
for the individual test results.
[ERROR] -> [Help 1]
[ERROR] 
[ERROR] To see the full stack trace of the errors, re-run Maven with the -e switch.
[ERROR] Re-run Maven using the -X switch to enable full debug logging.
[ERROR] 
[ERROR] For more information about the errors and possible solutions, please read the following
articles:
[ERROR] [Help 1] http://cwiki.apache.org/confluence/display/MAVEN/MojoFailureException
[ERROR] 
[ERROR] After correcting the problems, you can resume the build with the command
[ERROR]   mvn <goals> -rf :hadoop-mapreduce-client-jobclient
Build step 'Execute shell' marked build as failure
[FINDBUGS] Skipping publisher since build result is FAILURE
Archiving artifacts
Email was triggered for: Failure
Sending email for trigger: Failure



###################################################################################
############################## FAILED TESTS (if any) ##############################
No tests ran.
Mime
  • Unnamed multipart/mixed (inline, None, 0 bytes)
View raw message