hadoop-mapreduce-dev mailing list archives

Site index · List index
Message view « Date » · « Thread »
Top « Date » · « Thread »
From Apache Jenkins Server <jenk...@builds.apache.org>
Subject Hadoop-Mapreduce-trunk - Build # 1158 - Still Failing
Date Sun, 05 Aug 2012 14:03:52 GMT
See https://builds.apache.org/job/Hadoop-Mapreduce-trunk/1158/

###################################################################################
########################## LAST 60 LINES OF THE CONSOLE ###########################
[...truncated 30997 lines...]
Running org.apache.hadoop.mapreduce.TestMapReduce
Tests run: 1, Failures: 0, Errors: 0, Skipped: 0, Time elapsed: 4.473 sec

Results :

Failed tests:   testForEmptyFile(org.apache.hadoop.mapreduce.lib.input.TestCombineFileInputFormat):
expected:<0> but was:<1>

Tests run: 384, Failures: 1, Errors: 0, Skipped: 14

[INFO] ------------------------------------------------------------------------
[INFO] Reactor Summary:
[INFO] 
[INFO] hadoop-yarn ....................................... SUCCESS [1.850s]
[INFO] hadoop-yarn-api ................................... SUCCESS [8.027s]
[INFO] hadoop-yarn-common ................................ SUCCESS [29.569s]
[INFO] hadoop-yarn-server ................................ SUCCESS [0.108s]
[INFO] hadoop-yarn-server-common ......................... SUCCESS [2.642s]
[INFO] hadoop-yarn-server-nodemanager .................... SUCCESS [2:23.757s]
[INFO] hadoop-yarn-server-web-proxy ...................... SUCCESS [1.274s]
[INFO] hadoop-yarn-server-resourcemanager ................ SUCCESS [3:34.294s]
[INFO] hadoop-yarn-server-tests .......................... SUCCESS [40.785s]
[INFO] hadoop-mapreduce-client ........................... SUCCESS [0.060s]
[INFO] hadoop-mapreduce-client-core ...................... SUCCESS [1:13.718s]
[INFO] hadoop-yarn-applications .......................... SUCCESS [0.085s]
[INFO] hadoop-yarn-applications-distributedshell ......... SUCCESS [12.267s]
[INFO] hadoop-yarn-applications-unmanaged-am-launcher .... SUCCESS [9.863s]
[INFO] hadoop-yarn-site .................................. SUCCESS [0.143s]
[INFO] hadoop-mapreduce-client-common .................... SUCCESS [18.849s]
[INFO] hadoop-mapreduce-client-shuffle ................... SUCCESS [0.991s]
[INFO] hadoop-mapreduce-client-app ....................... SUCCESS [4:30.627s]
[INFO] hadoop-mapreduce-client-hs ........................ SUCCESS [1:05.707s]
[INFO] hadoop-mapreduce-client-jobclient ................. FAILURE [35:06.298s]
[INFO] Apache Hadoop MapReduce Examples .................. SKIPPED
[INFO] hadoop-mapreduce .................................. SKIPPED
[INFO] ------------------------------------------------------------------------
[INFO] BUILD FAILURE
[INFO] ------------------------------------------------------------------------
[INFO] Total time: 50:02.144s
[INFO] Finished at: Sun Aug 05 14:03:45 UTC 2012
[INFO] Final Memory: 27M/251M
[INFO] ------------------------------------------------------------------------
[ERROR] Failed to execute goal org.apache.maven.plugins:maven-surefire-plugin:2.12:test (default-test)
on project hadoop-mapreduce-client-jobclient: There are test failures.
[ERROR] 
[ERROR] Please refer to /home/jenkins/jenkins-slave/workspace/Hadoop-Mapreduce-trunk/trunk/hadoop-mapreduce-project/hadoop-mapreduce-client/hadoop-mapreduce-client-jobclient/target/surefire-reports
for the individual test results.
[ERROR] -> [Help 1]
[ERROR] 
[ERROR] To see the full stack trace of the errors, re-run Maven with the -e switch.
[ERROR] Re-run Maven using the -X switch to enable full debug logging.
[ERROR] 
[ERROR] For more information about the errors and possible solutions, please read the following
articles:
[ERROR] [Help 1] http://cwiki.apache.org/confluence/display/MAVEN/MojoFailureException
[ERROR] 
[ERROR] After correcting the problems, you can resume the build with the command
[ERROR]   mvn <goals> -rf :hadoop-mapreduce-client-jobclient
Build step 'Execute shell' marked build as failure
[FINDBUGS] Skipping publisher since build result is FAILURE
Archiving artifacts
Email was triggered for: Failure
Sending email for trigger: Failure



###################################################################################
############################## FAILED TESTS (if any) ##############################
No tests ran.
Mime
  • Unnamed multipart/mixed (inline, None, 0 bytes)
View raw message