hadoop-mapreduce-dev mailing list archives

Site index · List index
Message view « Date » · « Thread »
Top « Date » · « Thread »
From Apache Jenkins Server <jenk...@builds.apache.org>
Subject Hadoop-Mapreduce-trunk - Build # 1170 - Still Failing
Date Sat, 18 Aug 2012 13:56:21 GMT
See https://builds.apache.org/job/Hadoop-Mapreduce-trunk/1170/

###################################################################################
########################## LAST 60 LINES OF THE CONSOLE ###########################
[...truncated 30238 lines...]
Tests run: 1, Failures: 0, Errors: 0, Skipped: 0, Time elapsed: 0.061 sec
Running org.apache.hadoop.mapreduce.TestMapReduce
Tests run: 1, Failures: 0, Errors: 0, Skipped: 0, Time elapsed: 4.521 sec

Results :

Failed tests:   testForEmptyFile(org.apache.hadoop.mapreduce.lib.input.TestCombineFileInputFormat):
expected:<0> but was:<1>

Tests in error: 
  testMissingBlocks(org.apache.hadoop.mapreduce.lib.input.TestCombineFileInputFormat): org.apache.hadoop.fs.BlockLocation

Tests run: 384, Failures: 1, Errors: 1, Skipped: 14

[INFO] ------------------------------------------------------------------------
[INFO] Reactor Summary:
[INFO] 
[INFO] hadoop-mapreduce-client ........................... SUCCESS [2.065s]
[INFO] hadoop-mapreduce-client-core ...................... SUCCESS [1:15.413s]
[INFO] hadoop-mapreduce-client-common .................... SUCCESS [21.190s]
[INFO] hadoop-mapreduce-client-shuffle ................... SUCCESS [1.071s]
[INFO] hadoop-mapreduce-client-app ....................... SUCCESS [4:25.931s]
[INFO] hadoop-mapreduce-client-hs ........................ SUCCESS [1:05.566s]
[INFO] hadoop-mapreduce-client-jobclient ................. FAILURE [35:09.180s]
[INFO] Apache Hadoop MapReduce Examples .................. SKIPPED
[INFO] hadoop-mapreduce .................................. SKIPPED
[INFO] ------------------------------------------------------------------------
[INFO] BUILD FAILURE
[INFO] ------------------------------------------------------------------------
[INFO] Total time: 42:20.966s
[INFO] Finished at: Sat Aug 18 13:56:12 UTC 2012
[INFO] Final Memory: 20M/142M
[INFO] ------------------------------------------------------------------------
[ERROR] Failed to execute goal org.apache.maven.plugins:maven-surefire-plugin:2.12:test (default-test)
on project hadoop-mapreduce-client-jobclient: There are test failures.
[ERROR] 
[ERROR] Please refer to /home/jenkins/jenkins-slave/workspace/Hadoop-Mapreduce-trunk/trunk/hadoop-mapreduce-project/hadoop-mapreduce-client/hadoop-mapreduce-client-jobclient/target/surefire-reports
for the individual test results.
[ERROR] -> [Help 1]
[ERROR] 
[ERROR] To see the full stack trace of the errors, re-run Maven with the -e switch.
[ERROR] Re-run Maven using the -X switch to enable full debug logging.
[ERROR] 
[ERROR] For more information about the errors and possible solutions, please read the following
articles:
[ERROR] [Help 1] http://cwiki.apache.org/confluence/display/MAVEN/MojoFailureException
[ERROR] 
[ERROR] After correcting the problems, you can resume the build with the command
[ERROR]   mvn <goals> -rf :hadoop-mapreduce-client-jobclient
Build step 'Execute shell' marked build as failure
[FINDBUGS] Skipping publisher since build result is FAILURE
Archiving artifacts
Updating HADOOP-8693
Updating HADOOP-8689
Updating HADOOP-8695
Updating HADOOP-8697
Updating HADOOP-8692
Updating HADOOP-8710
Updating HADOOP-7967
Updating HDFS-3672
Updating YARN-25
Email was triggered for: Failure
Sending email for trigger: Failure



###################################################################################
############################## FAILED TESTS (if any) ##############################
No tests ran.
Mime
  • Unnamed multipart/mixed (inline, None, 0 bytes)
View raw message