hadoop-mapreduce-dev mailing list archives

Site index · List index
Message view « Date » · « Thread »
Top « Date » · « Thread »
From Apache Jenkins Server <jenk...@builds.apache.org>
Subject Hadoop-Mapreduce-trunk - Build # 1175 - Still Failing
Date Fri, 24 Aug 2012 14:31:12 GMT
See https://builds.apache.org/job/Hadoop-Mapreduce-trunk/1175/

###################################################################################
########################## LAST 60 LINES OF THE CONSOLE ###########################
[...truncated 30066 lines...]

Tests run: 111, Failures: 3, Errors: 7, Skipped: 4

[INFO] ------------------------------------------------------------------------
[INFO] Reactor Summary:
[INFO] 
[INFO] hadoop-mapreduce-client ........................... SUCCESS [1.990s]
[INFO] hadoop-mapreduce-client-core ...................... SUCCESS [1:16.729s]
[INFO] hadoop-mapreduce-client-common .................... SUCCESS [21.228s]
[INFO] hadoop-mapreduce-client-shuffle ................... SUCCESS [1.069s]
[INFO] hadoop-mapreduce-client-app ....................... SUCCESS [4:22.434s]
[INFO] hadoop-mapreduce-client-hs ........................ SUCCESS [1:05.362s]
[INFO] hadoop-mapreduce-client-jobclient ................. FAILURE [1:09:47.904s]
[INFO] Apache Hadoop MapReduce Examples .................. SKIPPED
[INFO] hadoop-mapreduce .................................. SKIPPED
[INFO] ------------------------------------------------------------------------
[INFO] BUILD FAILURE
[INFO] ------------------------------------------------------------------------
[INFO] Total time: 1:16:57.257s
[INFO] Finished at: Fri Aug 24 14:31:00 UTC 2012
[INFO] Final Memory: 41M/137M
[INFO] ------------------------------------------------------------------------
[ERROR] Failed to execute goal org.apache.maven.plugins:maven-surefire-plugin:2.12:test (default-test)
on project hadoop-mapreduce-client-jobclient: ExecutionException; nested exception is java.util.concurrent.ExecutionException:
org.apache.maven.surefire.booter.SurefireBooterForkException: Error occurred in starting fork,
check output in log -> [Help 1]
[ERROR] 
[ERROR] To see the full stack trace of the errors, re-run Maven with the -e switch.
[ERROR] Re-run Maven using the -X switch to enable full debug logging.
[ERROR] 
[ERROR] For more information about the errors and possible solutions, please read the following
articles:
[ERROR] [Help 1] http://cwiki.apache.org/confluence/display/MAVEN/MojoExecutionException
[ERROR] 
[ERROR] After correcting the problems, you can resume the build with the command
[ERROR]   mvn <goals> -rf :hadoop-mapreduce-client-jobclient
Build step 'Execute shell' marked build as failure
[FINDBUGS] Skipping publisher since build result is FAILURE
Archiving artifacts
Updating MAPREDUCE-4470
Updating HDFS-3832
Updating HDFS-3835
Updating HADOOP-8075
Updating HDFS-3837
Updating HADOOP-8031
Updating HADOOP-4572
Updating HADOOP-8709
Updating HADOOP-8225
Updating HADOOP-8720
Updating HDFS-3672
Updating HDFS-3819
Updating HADOOP-8721
Updating HDFS-3715
Updating MAPREDUCE-2374
Updating HDFS-3830
Updating MAPREDUCE-4068
Updating HDFS-3817
Updating HDFS-2686
Updating HADOOP-8632
Updating MAPREDUCE-4577
Updating HADOOP-8655
Email was triggered for: Failure
Sending email for trigger: Failure



###################################################################################
############################## FAILED TESTS (if any) ##############################
No tests ran.
Mime
  • Unnamed multipart/mixed (inline, None, 0 bytes)
View raw message