hadoop-mapreduce-dev mailing list archives

Site index · List index
Message view « Date » · « Thread »
Top « Date » · « Thread »
From Apache Jenkins Server <jenk...@builds.apache.org>
Subject Hadoop-Mapreduce-trunk - Build # 1157 - Still Failing
Date Sat, 04 Aug 2012 14:03:51 GMT
See https://builds.apache.org/job/Hadoop-Mapreduce-trunk/1157/

###################################################################################
########################## LAST 60 LINES OF THE CONSOLE ###########################
[...truncated 31006 lines...]
Tests run: 1, Failures: 0, Errors: 0, Skipped: 0, Time elapsed: 4.488 sec

Results :

Failed tests:   testForEmptyFile(org.apache.hadoop.mapreduce.lib.input.TestCombineFileInputFormat):
expected:<0> but was:<1>

Tests run: 384, Failures: 1, Errors: 0, Skipped: 14

[INFO] ------------------------------------------------------------------------
[INFO] Reactor Summary:
[INFO] 
[INFO] hadoop-yarn ....................................... SUCCESS [1.815s]
[INFO] hadoop-yarn-api ................................... SUCCESS [7.968s]
[INFO] hadoop-yarn-common ................................ SUCCESS [30.152s]
[INFO] hadoop-yarn-server ................................ SUCCESS [0.116s]
[INFO] hadoop-yarn-server-common ......................... SUCCESS [2.697s]
[INFO] hadoop-yarn-server-nodemanager .................... SUCCESS [2:23.779s]
[INFO] hadoop-yarn-server-web-proxy ...................... SUCCESS [1.239s]
[INFO] hadoop-yarn-server-resourcemanager ................ SUCCESS [3:37.225s]
[INFO] hadoop-yarn-server-tests .......................... SUCCESS [40.672s]
[INFO] hadoop-mapreduce-client ........................... SUCCESS [0.062s]
[INFO] hadoop-mapreduce-client-core ...................... SUCCESS [1:23.593s]
[INFO] hadoop-yarn-applications .......................... SUCCESS [0.090s]
[INFO] hadoop-yarn-applications-distributedshell ......... SUCCESS [12.282s]
[INFO] hadoop-yarn-applications-unmanaged-am-launcher .... SUCCESS [9.883s]
[INFO] hadoop-yarn-site .................................. SUCCESS [0.160s]
[INFO] hadoop-mapreduce-client-common .................... SUCCESS [18.762s]
[INFO] hadoop-mapreduce-client-shuffle ................... SUCCESS [0.983s]
[INFO] hadoop-mapreduce-client-app ....................... SUCCESS [4:25.576s]
[INFO] hadoop-mapreduce-client-hs ........................ SUCCESS [1:08.317s]
[INFO] hadoop-mapreduce-client-jobclient ................. FAILURE [34:45.365s]
[INFO] Apache Hadoop MapReduce Examples .................. SKIPPED
[INFO] hadoop-mapreduce .................................. SKIPPED
[INFO] ------------------------------------------------------------------------
[INFO] BUILD FAILURE
[INFO] ------------------------------------------------------------------------
[INFO] Total time: 49:51.961s
[INFO] Finished at: Sat Aug 04 14:03:40 UTC 2012
[INFO] Final Memory: 27M/451M
[INFO] ------------------------------------------------------------------------
[ERROR] Failed to execute goal org.apache.maven.plugins:maven-surefire-plugin:2.12:test (default-test)
on project hadoop-mapreduce-client-jobclient: There are test failures.
[ERROR] 
[ERROR] Please refer to /home/jenkins/jenkins-slave/workspace/Hadoop-Mapreduce-trunk/trunk/hadoop-mapreduce-project/hadoop-mapreduce-client/hadoop-mapreduce-client-jobclient/target/surefire-reports
for the individual test results.
[ERROR] -> [Help 1]
[ERROR] 
[ERROR] To see the full stack trace of the errors, re-run Maven with the -e switch.
[ERROR] Re-run Maven using the -X switch to enable full debug logging.
[ERROR] 
[ERROR] For more information about the errors and possible solutions, please read the following
articles:
[ERROR] [Help 1] http://cwiki.apache.org/confluence/display/MAVEN/MojoFailureException
[ERROR] 
[ERROR] After correcting the problems, you can resume the build with the command
[ERROR]   mvn <goals> -rf :hadoop-mapreduce-client-jobclient
Build step 'Execute shell' marked build as failure
[FINDBUGS] Skipping publisher since build result is FAILURE
Archiving artifacts
Updating MAPREDUCE-4503
Email was triggered for: Failure
Sending email for trigger: Failure



###################################################################################
############################## FAILED TESTS (if any) ##############################
No tests ran.
Mime
  • Unnamed multipart/mixed (inline, None, 0 bytes)
View raw message