hadoop-mapreduce-dev mailing list archives

Site index · List index
Message view « Date » · « Thread »
Top « Date » · « Thread »
From Apache Jenkins Server <jenk...@builds.apache.org>
Subject Hadoop-Mapreduce-trunk - Build # 1112 - Still Failing
Date Sun, 17 Jun 2012 14:19:02 GMT
See https://builds.apache.org/job/Hadoop-Mapreduce-trunk/1112/

###################################################################################
########################## LAST 60 LINES OF THE CONSOLE ###########################
[...truncated 30157 lines...]
Running org.apache.hadoop.mapreduce.lib.partition.TestMRKeyFieldBasedPartitioner
Tests run: 1, Failures: 0, Errors: 0, Skipped: 0, Time elapsed: 0.336 sec
Running org.apache.hadoop.mapreduce.TestChild
Tests run: 1, Failures: 0, Errors: 0, Skipped: 0, Time elapsed: 37.354 sec
Running org.apache.hadoop.mapreduce.filecache.TestURIFragments
Tests run: 1, Failures: 0, Errors: 0, Skipped: 0, Time elapsed: 0.062 sec
Running org.apache.hadoop.mapreduce.TestMapReduce
Tests run: 1, Failures: 0, Errors: 0, Skipped: 0, Time elapsed: 4.394 sec

Results :

Tests run: 424, Failures: 0, Errors: 0, Skipped: 15

[INFO] ------------------------------------------------------------------------
[INFO] Reactor Summary:
[INFO] 
[INFO] hadoop-yarn ....................................... SUCCESS [1.957s]
[INFO] hadoop-yarn-api ................................... SUCCESS [7.988s]
[INFO] hadoop-yarn-common ................................ SUCCESS [30.485s]
[INFO] hadoop-yarn-server ................................ SUCCESS [0.115s]
[INFO] hadoop-yarn-server-common ......................... SUCCESS [4.060s]
[INFO] hadoop-yarn-server-nodemanager .................... SUCCESS [2:24.847s]
[INFO] hadoop-yarn-server-web-proxy ...................... SUCCESS [1.249s]
[INFO] hadoop-yarn-server-resourcemanager ................ SUCCESS [3:30.700s]
[INFO] hadoop-yarn-server-tests .......................... SUCCESS [40.777s]
[INFO] hadoop-mapreduce-client ........................... SUCCESS [0.064s]
[INFO] hadoop-mapreduce-client-core ...................... SUCCESS [38.594s]
[INFO] hadoop-yarn-applications .......................... SUCCESS [0.091s]
[INFO] hadoop-yarn-applications-distributedshell ......... SUCCESS [22.247s]
[INFO] hadoop-yarn-site .................................. SUCCESS [0.170s]
[INFO] hadoop-mapreduce-client-common .................... SUCCESS [19.016s]
[INFO] hadoop-mapreduce-client-shuffle ................... SUCCESS [0.988s]
[INFO] hadoop-mapreduce-client-app ....................... SUCCESS [4:27.870s]
[INFO] hadoop-mapreduce-client-hs ........................ SUCCESS [1:04.924s]
[INFO] hadoop-mapreduce-client-jobclient ................. FAILURE [48:06.421s]
[INFO] Apache Hadoop MapReduce Examples .................. SKIPPED
[INFO] hadoop-mapreduce .................................. SKIPPED
[INFO] ------------------------------------------------------------------------
[INFO] BUILD FAILURE
[INFO] ------------------------------------------------------------------------
[INFO] Total time: 1:02:23.594s
[INFO] Finished at: Sun Jun 17 14:18:51 UTC 2012
[INFO] Final Memory: 82M/504M
[INFO] ------------------------------------------------------------------------
[ERROR] Failed to execute goal org.apache.maven.plugins:maven-surefire-plugin:2.12:test (default-test)
on project hadoop-mapreduce-client-jobclient: Failure or timeout -> [Help 1]
[ERROR] 
[ERROR] To see the full stack trace of the errors, re-run Maven with the -e switch.
[ERROR] Re-run Maven using the -X switch to enable full debug logging.
[ERROR] 
[ERROR] For more information about the errors and possible solutions, please read the following
articles:
[ERROR] [Help 1] http://cwiki.apache.org/confluence/display/MAVEN/MojoExecutionException
[ERROR] 
[ERROR] After correcting the problems, you can resume the build with the command
[ERROR]   mvn <goals> -rf :hadoop-mapreduce-client-jobclient
Build step 'Execute shell' marked build as failure
[FINDBUGS] Skipping publisher since build result is FAILURE
Archiving artifacts
Email was triggered for: Failure
Sending email for trigger: Failure



###################################################################################
############################## FAILED TESTS (if any) ##############################
No tests ran.
Mime
  • Unnamed multipart/mixed (inline, None, 0 bytes)
View raw message