hadoop-mapreduce-dev mailing list archives

Site index · List index
Message view « Date » · « Thread »
Top « Date » · « Thread »
From Apache Jenkins Server <jenk...@builds.apache.org>
Subject Hadoop-Mapreduce-trunk - Build # 1108 - Still Failing
Date Wed, 13 Jun 2012 14:18:35 GMT
See https://builds.apache.org/job/Hadoop-Mapreduce-trunk/1108/

###################################################################################
########################## LAST 60 LINES OF THE CONSOLE ###########################
[...truncated 30161 lines...]
[INFO] ------------------------------------------------------------------------
[INFO] Reactor Summary:
[INFO] 
[INFO] hadoop-yarn ....................................... SUCCESS [1.979s]
[INFO] hadoop-yarn-api ................................... SUCCESS [8.024s]
[INFO] hadoop-yarn-common ................................ SUCCESS [31.106s]
[INFO] hadoop-yarn-server ................................ SUCCESS [0.112s]
[INFO] hadoop-yarn-server-common ......................... SUCCESS [4.033s]
[INFO] hadoop-yarn-server-nodemanager .................... SUCCESS [2:25.155s]
[INFO] hadoop-yarn-server-web-proxy ...................... SUCCESS [1.244s]
[INFO] hadoop-yarn-server-resourcemanager ................ SUCCESS [3:34.056s]
[INFO] hadoop-yarn-server-tests .......................... SUCCESS [40.585s]
[INFO] hadoop-mapreduce-client ........................... SUCCESS [0.061s]
[INFO] hadoop-mapreduce-client-core ...................... SUCCESS [38.945s]
[INFO] hadoop-yarn-applications .......................... SUCCESS [0.093s]
[INFO] hadoop-yarn-applications-distributedshell ......... SUCCESS [22.281s]
[INFO] hadoop-yarn-site .................................. SUCCESS [0.166s]
[INFO] hadoop-mapreduce-client-common .................... SUCCESS [19.298s]
[INFO] hadoop-mapreduce-client-shuffle ................... SUCCESS [1.004s]
[INFO] hadoop-mapreduce-client-app ....................... SUCCESS [4:25.852s]
[INFO] hadoop-mapreduce-client-hs ........................ SUCCESS [1:06.992s]
[INFO] hadoop-mapreduce-client-jobclient ................. FAILURE [47:57.147s]
[INFO] Apache Hadoop MapReduce Examples .................. SKIPPED
[INFO] hadoop-mapreduce .................................. SKIPPED
[INFO] ------------------------------------------------------------------------
[INFO] BUILD FAILURE
[INFO] ------------------------------------------------------------------------
[INFO] Total time: 1:02:19.152s
[INFO] Finished at: Wed Jun 13 14:17:58 UTC 2012
[INFO] Final Memory: 82M/380M
[INFO] ------------------------------------------------------------------------
[ERROR] Failed to execute goal org.apache.maven.plugins:maven-surefire-plugin:2.12:test (default-test)
on project hadoop-mapreduce-client-jobclient: Failure or timeout -> [Help 1]
[ERROR] 
[ERROR] To see the full stack trace of the errors, re-run Maven with the -e switch.
[ERROR] Re-run Maven using the -X switch to enable full debug logging.
[ERROR] 
[ERROR] For more information about the errors and possible solutions, please read the following
articles:
[ERROR] [Help 1] http://cwiki.apache.org/confluence/display/MAVEN/MojoExecutionException
[ERROR] 
[ERROR] After correcting the problems, you can resume the build with the command
[ERROR]   mvn <goals> -rf :hadoop-mapreduce-client-jobclient
Build step 'Execute shell' marked build as failure
[FINDBUGS] Skipping publisher since build result is FAILURE
Archiving artifacts
Updating HDFS-3228
Updating HDFS-3372
Updating HDFS-3428
Updating HDFS-766
Updating HDFS-3408
Updating HDFS-3480
Updating HADOOP-8465
Updating HADOOP-8433
Updating HADOOP-8507
Updating HDFS-3478
Updating HADOOP-8458
Updating HDFS-3531
Updating HDFS-3389
Email was triggered for: Failure
Sending email for trigger: Failure



###################################################################################
############################## FAILED TESTS (if any) ##############################
No tests ran.
Mime
  • Unnamed multipart/mixed (inline, None, 0 bytes)
View raw message