hadoop-mapreduce-dev mailing list archives

Site index · List index
Message view « Date » · « Thread »
Top « Date » · « Thread »
From Apache Jenkins Server <jenk...@builds.apache.org>
Subject Hadoop-Mapreduce-trunk - Build # 1117 - Still Failing
Date Fri, 22 Jun 2012 14:43:04 GMT
See https://builds.apache.org/job/Hadoop-Mapreduce-trunk/1117/

###################################################################################
########################## LAST 60 LINES OF THE CONSOLE ###########################
[...truncated 27753 lines...]
Tests run: 17, Failures: 0, Errors: 0, Skipped: 0, Time elapsed: 3.531 sec
Running org.apache.hadoop.util.TestRunJar
Tests run: 1, Failures: 0, Errors: 0, Skipped: 0, Time elapsed: 0.243 sec
Running org.apache.hadoop.util.TestReflectionUtils
Tests run: 1, Failures: 0, Errors: 0, Skipped: 0, Time elapsed: 0.28 sec

Results :

Tests run: 424, Failures: 0, Errors: 0, Skipped: 15

[INFO] ------------------------------------------------------------------------
[INFO] Reactor Summary:
[INFO] 
[INFO] hadoop-yarn ....................................... SUCCESS [2.200s]
[INFO] hadoop-yarn-api ................................... SUCCESS [8.161s]
[INFO] hadoop-yarn-common ................................ SUCCESS [30.947s]
[INFO] hadoop-yarn-server ................................ SUCCESS [0.114s]
[INFO] hadoop-yarn-server-common ......................... SUCCESS [4.411s]
[INFO] hadoop-yarn-server-nodemanager .................... SUCCESS [2:25.805s]
[INFO] hadoop-yarn-server-web-proxy ...................... SUCCESS [1.266s]
[INFO] hadoop-yarn-server-resourcemanager ................ SUCCESS [3:30.972s]
[INFO] hadoop-yarn-server-tests .......................... SUCCESS [40.596s]
[INFO] hadoop-mapreduce-client ........................... SUCCESS [0.065s]
[INFO] hadoop-mapreduce-client-core ...................... SUCCESS [38.823s]
[INFO] hadoop-yarn-applications .......................... SUCCESS [0.188s]
[INFO] hadoop-yarn-applications-distributedshell ......... SUCCESS [23.782s]
[INFO] hadoop-yarn-site .................................. SUCCESS [0.170s]
[INFO] hadoop-mapreduce-client-common .................... SUCCESS [18.878s]
[INFO] hadoop-mapreduce-client-shuffle ................... SUCCESS [1.059s]
[INFO] hadoop-mapreduce-client-app ....................... SUCCESS [4:23.797s]
[INFO] hadoop-mapreduce-client-hs ........................ SUCCESS [1:06.600s]
[INFO] hadoop-mapreduce-client-jobclient ................. FAILURE [47:30.675s]
[INFO] Apache Hadoop MapReduce Examples .................. SKIPPED
[INFO] hadoop-mapreduce .................................. SKIPPED
[INFO] ------------------------------------------------------------------------
[INFO] BUILD FAILURE
[INFO] ------------------------------------------------------------------------
[INFO] Total time: 1:01:49.524s
[INFO] Finished at: Fri Jun 22 14:42:57 UTC 2012
[INFO] Final Memory: 32M/307M
[INFO] ------------------------------------------------------------------------
[ERROR] Failed to execute goal org.apache.maven.plugins:maven-surefire-plugin:2.12:test (default-test)
on project hadoop-mapreduce-client-jobclient: Failure or timeout -> [Help 1]
[ERROR] 
[ERROR] To see the full stack trace of the errors, re-run Maven with the -e switch.
[ERROR] Re-run Maven using the -X switch to enable full debug logging.
[ERROR] 
[ERROR] For more information about the errors and possible solutions, please read the following
articles:
[ERROR] [Help 1] http://cwiki.apache.org/confluence/display/MAVEN/MojoExecutionException
[ERROR] 
[ERROR] After correcting the problems, you can resume the build with the command
[ERROR]   mvn <goals> -rf :hadoop-mapreduce-client-jobclient
Build step 'Execute shell' marked build as failure
[FINDBUGS] Skipping publisher since build result is FAILURE
Archiving artifacts
Updating HADOOP-8524
Updating MAPREDUCE-4320
Updating MAPREDUCE-4295
Email was triggered for: Failure
Sending email for trigger: Failure



###################################################################################
############################## FAILED TESTS (if any) ##############################
No tests ran.
Mime
  • Unnamed multipart/mixed (inline, None, 0 bytes)
View raw message