hadoop-mapreduce-dev mailing list archives

Site index · List index
Message view « Date » · « Thread »
Top « Date » · « Thread »
From Apache Jenkins Server <jenk...@builds.apache.org>
Subject Hadoop-Mapreduce-trunk - Build # 1123 - Still Failing
Date Thu, 28 Jun 2012 14:24:21 GMT
See https://builds.apache.org/job/Hadoop-Mapreduce-trunk/1123/

###################################################################################
########################## LAST 60 LINES OF THE CONSOLE ###########################
[...truncated 30646 lines...]
Tests run: 1, Failures: 0, Errors: 0, Skipped: 0, Time elapsed: 4.366 sec

Results :

Tests run: 425, Failures: 0, Errors: 0, Skipped: 15

[INFO] ------------------------------------------------------------------------
[INFO] Reactor Summary:
[INFO] 
[INFO] hadoop-yarn ....................................... SUCCESS [1.942s]
[INFO] hadoop-yarn-api ................................... SUCCESS [7.991s]
[INFO] hadoop-yarn-common ................................ SUCCESS [31.077s]
[INFO] hadoop-yarn-server ................................ SUCCESS [0.115s]
[INFO] hadoop-yarn-server-common ......................... SUCCESS [4.144s]
[INFO] hadoop-yarn-server-nodemanager .................... SUCCESS [2:24.050s]
[INFO] hadoop-yarn-server-web-proxy ...................... SUCCESS [1.244s]
[INFO] hadoop-yarn-server-resourcemanager ................ SUCCESS [3:30.609s]
[INFO] hadoop-yarn-server-tests .......................... SUCCESS [41.558s]
[INFO] hadoop-mapreduce-client ........................... SUCCESS [0.059s]
[INFO] hadoop-mapreduce-client-core ...................... SUCCESS [39.239s]
[INFO] hadoop-yarn-applications .......................... SUCCESS [0.089s]
[INFO] hadoop-yarn-applications-distributedshell ......... SUCCESS [22.192s]
[INFO] hadoop-yarn-site .................................. SUCCESS [0.155s]
[INFO] hadoop-mapreduce-client-common .................... SUCCESS [18.786s]
[INFO] hadoop-mapreduce-client-shuffle ................... SUCCESS [0.987s]
[INFO] hadoop-mapreduce-client-app ....................... SUCCESS [4:26.524s]
[INFO] hadoop-mapreduce-client-hs ........................ SUCCESS [1:07.277s]
[INFO] hadoop-mapreduce-client-jobclient ................. FAILURE [49:47.281s]
[INFO] Apache Hadoop MapReduce Examples .................. SKIPPED
[INFO] hadoop-mapreduce .................................. SKIPPED
[INFO] ------------------------------------------------------------------------
[INFO] BUILD FAILURE
[INFO] ------------------------------------------------------------------------
[INFO] Total time: 1:04:06.346s
[INFO] Finished at: Thu Jun 28 14:24:07 UTC 2012
[INFO] Final Memory: 81M/465M
[INFO] ------------------------------------------------------------------------
[ERROR] Failed to execute goal org.apache.maven.plugins:maven-surefire-plugin:2.12:test (default-test)
on project hadoop-mapreduce-client-jobclient: Failure or timeout -> [Help 1]
[ERROR] 
[ERROR] To see the full stack trace of the errors, re-run Maven with the -e switch.
[ERROR] Re-run Maven using the -X switch to enable full debug logging.
[ERROR] 
[ERROR] For more information about the errors and possible solutions, please read the following
articles:
[ERROR] [Help 1] http://cwiki.apache.org/confluence/display/MAVEN/MojoExecutionException
[ERROR] 
[ERROR] After correcting the problems, you can resume the build with the command
[ERROR]   mvn <goals> -rf :hadoop-mapreduce-client-jobclient
Build step 'Execute shell' marked build as failure
[FINDBUGS] Skipping publisher since build result is FAILURE
Archiving artifacts
Updating MAPREDUCE-4346
Updating HDFS-3576
Updating HDFS-3572
Updating HADOOP-8059
Updating HDFS-3481
Updating MAPREDUCE-4372
Updating HDFS-3113
Email was triggered for: Failure
Sending email for trigger: Failure



###################################################################################
############################## FAILED TESTS (if any) ##############################
No tests ran.
Mime
  • Unnamed multipart/mixed (inline, None, 0 bytes)
View raw message