hadoop-mapreduce-dev mailing list archives

Site index · List index
Message view « Date » · « Thread »
Top « Date » · « Thread »
From Apache Jenkins Server <jenk...@builds.apache.org>
Subject Hadoop-Mapreduce-22-branch - Build # 105 - Failure
Date Fri, 08 Jun 2012 05:02:05 GMT
See https://builds.apache.org/job/Hadoop-Mapreduce-22-branch/105/

###################################################################################
########################## LAST 60 LINES OF THE CONSOLE ###########################
[...truncated 509675 lines...]
    [junit] 12/06/08 04:59:59 INFO datanode.DataBlockScanner: Exiting DataBlockScanner thread.
    [junit] 12/06/08 04:59:59 INFO datanode.DataNode: DatanodeRegistration(127.0.0.1:40648,
storageID=DS-857628450-67.195.138.25-40648-1339131598757, infoPort=47087, ipcPort=34525):Finishing
DataNode in: FSDataset{dirpath='/home/jenkins/jenkins-slave/workspace/Hadoop-Mapreduce-22-branch/trunk/build/contrib/raid/test/data/dfs/data/data3/current/finalized,/home/jenkins/jenkins-slave/workspace/Hadoop-Mapreduce-22-branch/trunk/build/contrib/raid/test/data/dfs/data/data4/current/finalized'}
    [junit] 12/06/08 04:59:59 INFO ipc.Server: Stopping server on 34525
    [junit] 12/06/08 04:59:59 INFO datanode.DataNode: Waiting for threadgroup to exit, active
threads is 0
    [junit] 12/06/08 04:59:59 INFO datanode.FSDatasetAsyncDiskService: Shutting down all async
disk service threads...
    [junit] 12/06/08 04:59:59 INFO datanode.FSDatasetAsyncDiskService: All async disk service
threads have been shut down.
    [junit] 12/06/08 04:59:59 WARN datanode.FSDatasetAsyncDiskService: AsyncDiskService has
already shut down.
    [junit] 12/06/08 04:59:59 INFO hdfs.MiniDFSCluster: Shutting down DataNode 0
    [junit] 12/06/08 04:59:59 INFO mortbay.log: Stopped SelectChannelConnector@localhost:0
    [junit] 12/06/08 04:59:59 INFO ipc.Server: Stopping server on 47314
    [junit] 12/06/08 04:59:59 INFO ipc.Server: IPC Server handler 1 on 47314: exiting
    [junit] 12/06/08 04:59:59 INFO ipc.Server: IPC Server handler 2 on 47314: exiting
    [junit] 12/06/08 04:59:59 INFO ipc.Server: IPC Server handler 0 on 47314: exiting
    [junit] 12/06/08 04:59:59 INFO ipc.Server: Stopping IPC Server listener on 47314
    [junit] 12/06/08 04:59:59 INFO ipc.Server: Stopping IPC Server Responder
    [junit] 12/06/08 04:59:59 INFO datanode.DataNode: Waiting for threadgroup to exit, active
threads is 1
    [junit] 12/06/08 04:59:59 INFO datanode.DataBlockScanner: Exiting DataBlockScanner thread.
    [junit] 12/06/08 04:59:59 INFO datanode.DataNode: DatanodeRegistration(127.0.0.1:43671,
storageID=DS-9856416-67.195.138.25-43671-1339131598639, infoPort=43027, ipcPort=47314):Finishing
DataNode in: FSDataset{dirpath='/home/jenkins/jenkins-slave/workspace/Hadoop-Mapreduce-22-branch/trunk/build/contrib/raid/test/data/dfs/data/data1/current/finalized,/home/jenkins/jenkins-slave/workspace/Hadoop-Mapreduce-22-branch/trunk/build/contrib/raid/test/data/dfs/data/data2/current/finalized'}
    [junit] 12/06/08 04:59:59 INFO ipc.Server: Stopping server on 47314
    [junit] 12/06/08 04:59:59 INFO datanode.DataNode: Waiting for threadgroup to exit, active
threads is 0
    [junit] 12/06/08 04:59:59 INFO datanode.FSDatasetAsyncDiskService: Shutting down all async
disk service threads...
    [junit] 12/06/08 04:59:59 INFO datanode.FSDatasetAsyncDiskService: All async disk service
threads have been shut down.
    [junit] 12/06/08 04:59:59 WARN datanode.FSDatasetAsyncDiskService: AsyncDiskService has
already shut down.
    [junit] 12/06/08 04:59:59 INFO mortbay.log: Stopped SelectChannelConnector@localhost:0
    [junit] 12/06/08 04:59:59 WARN namenode.FSNamesystem: ReplicationMonitor thread received
InterruptedException.java.lang.InterruptedException: sleep interrupted
    [junit] 12/06/08 04:59:59 WARN namenode.DecommissionManager: Monitor interrupted: java.lang.InterruptedException:
sleep interrupted
    [junit] 12/06/08 04:59:59 INFO namenode.FSEditLog: Number of transactions: 14 Total time
for transactions(ms): 1Number of transactions batched in Syncs: 0 Number of syncs: 7 SyncTimes(ms):
4 5 
    [junit] 12/06/08 04:59:59 INFO ipc.Server: Stopping server on 59779
    [junit] 12/06/08 04:59:59 INFO ipc.Server: IPC Server handler 1 on 59779: exiting
    [junit] 12/06/08 04:59:59 INFO ipc.Server: IPC Server handler 3 on 59779: exiting
    [junit] 12/06/08 04:59:59 INFO ipc.Server: IPC Server handler 6 on 59779: exiting
    [junit] 12/06/08 04:59:59 INFO ipc.Server: IPC Server handler 4 on 59779: exiting
    [junit] 12/06/08 04:59:59 INFO ipc.Server: IPC Server handler 0 on 59779: exiting
    [junit] 12/06/08 04:59:59 INFO ipc.Server: IPC Server handler 2 on 59779: exiting
    [junit] 12/06/08 04:59:59 INFO ipc.Server: IPC Server handler 9 on 59779: exiting
    [junit] 12/06/08 04:59:59 INFO ipc.Server: IPC Server handler 8 on 59779: exiting
    [junit] 12/06/08 04:59:59 INFO ipc.Server: IPC Server handler 7 on 59779: exiting
    [junit] 12/06/08 04:59:59 INFO ipc.Server: IPC Server handler 5 on 59779: exiting
    [junit] 12/06/08 04:59:59 INFO ipc.Server: Stopping IPC Server listener on 59779
    [junit] 12/06/08 04:59:59 INFO ipc.Server: Stopping IPC Server Responder
    [junit] Tests run: 1, Failures: 0, Errors: 0, Time elapsed: 2.714 sec

test:

BUILD FAILED
/home/jenkins/jenkins-slave/workspace/Hadoop-Mapreduce-22-branch/trunk/build.xml:836: The
following error occurred while executing this line:
/home/jenkins/jenkins-slave/workspace/Hadoop-Mapreduce-22-branch/trunk/build.xml:815: The
following error occurred while executing this line:
/home/jenkins/jenkins-slave/workspace/Hadoop-Mapreduce-22-branch/trunk/src/contrib/build.xml:109:
Tests failed!

Total time: 208 minutes 29 seconds
Build step 'Execute shell' marked build as failure
[FINDBUGS] Skipping publisher since build result is FAILURE
Archiving artifacts
Recording test results
Publishing Javadoc
Recording fingerprints
Updating MAPREDUCE-4318
Email was triggered for: Failure
Sending email for trigger: Failure



###################################################################################
############################## FAILED TESTS (if any) ##############################
1 tests failed.
REGRESSION:  org.apache.hadoop.mapred.TestCapacitySchedulerServlet.testCapacitySchedulerServlet

Error Message:
Timeout occurred. Please note the time in the report does not reflect the time until the timeout.

Stack Trace:
junit.framework.AssertionFailedError: Timeout occurred. Please note the time in the report
does not reflect the time until the timeout.



Mime
  • Unnamed multipart/mixed (inline, None, 0 bytes)
View raw message