hadoop-mapreduce-dev mailing list archives

Site index · List index
Message view « Date » · « Thread »
Top « Date » · « Thread »
From Apache Jenkins Server <jenk...@builds.apache.org>
Subject Hadoop-Mapreduce-trunk - Build # 1110 - Still Failing
Date Fri, 15 Jun 2012 14:10:56 GMT
See https://builds.apache.org/job/Hadoop-Mapreduce-trunk/1110/

###################################################################################
########################## LAST 60 LINES OF THE CONSOLE ###########################
[...truncated 12454 lines...]
Running org.apache.hadoop.mapreduce.TestChild
Tests run: 1, Failures: 0, Errors: 0, Skipped: 0, Time elapsed: 47.326 sec
Running org.apache.hadoop.mapreduce.filecache.TestURIFragments
Tests run: 1, Failures: 0, Errors: 0, Skipped: 0, Time elapsed: 0.062 sec
Running org.apache.hadoop.mapreduce.TestMapReduce
Tests run: 1, Failures: 0, Errors: 0, Skipped: 0, Time elapsed: 4.374 sec

Results :

Tests run: 424, Failures: 0, Errors: 0, Skipped: 15

[INFO] ------------------------------------------------------------------------
[INFO] Reactor Summary:
[INFO] 
[INFO] hadoop-yarn ....................................... SUCCESS [2.138s]
[INFO] hadoop-yarn-api ................................... SUCCESS [7.992s]
[INFO] hadoop-yarn-common ................................ SUCCESS [37.858s]
[INFO] hadoop-yarn-server ................................ SUCCESS [0.114s]
[INFO] hadoop-yarn-server-common ......................... SUCCESS [4.913s]
[INFO] hadoop-yarn-server-nodemanager .................... SUCCESS [2:29.031s]
[INFO] hadoop-yarn-server-web-proxy ...................... SUCCESS [2.671s]
[INFO] hadoop-yarn-server-resourcemanager ................ SUCCESS [3:37.932s]
[INFO] hadoop-yarn-server-tests .......................... SUCCESS [41.371s]
[INFO] hadoop-mapreduce-client ........................... SUCCESS [0.064s]
[INFO] hadoop-mapreduce-client-core ...................... SUCCESS [47.012s]
[INFO] hadoop-yarn-applications .......................... SUCCESS [0.088s]
[INFO] hadoop-yarn-applications-distributedshell ......... SUCCESS [23.535s]
[INFO] hadoop-yarn-site .................................. SUCCESS [0.276s]
[INFO] hadoop-mapreduce-client-common .................... SUCCESS [20.495s]
[INFO] hadoop-mapreduce-client-shuffle ................... SUCCESS [3.061s]
[INFO] hadoop-mapreduce-client-app ....................... SUCCESS [4:35.787s]
[INFO] hadoop-mapreduce-client-hs ........................ SUCCESS [1:10.974s]
[INFO] hadoop-mapreduce-client-jobclient ................. FAILURE [48:06.622s]
[INFO] Apache Hadoop MapReduce Examples .................. SKIPPED
[INFO] hadoop-mapreduce .................................. SKIPPED
[INFO] ------------------------------------------------------------------------
[INFO] BUILD FAILURE
[INFO] ------------------------------------------------------------------------
[INFO] Total time: 1:03:12.962s
[INFO] Finished at: Fri Jun 15 14:10:53 UTC 2012
[INFO] Final Memory: 56M/812M
[INFO] ------------------------------------------------------------------------
[ERROR] Failed to execute goal org.apache.maven.plugins:maven-surefire-plugin:2.12:test (default-test)
on project hadoop-mapreduce-client-jobclient: Failure or timeout -> [Help 1]
[ERROR] 
[ERROR] To see the full stack trace of the errors, re-run Maven with the -e switch.
[ERROR] Re-run Maven using the -X switch to enable full debug logging.
[ERROR] 
[ERROR] For more information about the errors and possible solutions, please read the following
articles:
[ERROR] [Help 1] http://cwiki.apache.org/confluence/display/MAVEN/MojoExecutionException
[ERROR] 
[ERROR] After correcting the problems, you can resume the build with the command
[ERROR]   mvn <goals> -rf :hadoop-mapreduce-client-jobclient
Build step 'Execute shell' marked build as failure
[FINDBUGS] Skipping publisher since build result is FAILURE
Archiving artifacts
Updating HDFS-3524
Updating HDFS-3522
Email was triggered for: Failure
Sending email for trigger: Failure



###################################################################################
############################## FAILED TESTS (if any) ##############################
No tests ran.
Mime
  • Unnamed multipart/mixed (inline, None, 0 bytes)
View raw message