hadoop-mapreduce-dev mailing list archives

Site index · List index
Message view « Date » · « Thread »
Top « Date » · « Thread »
From Apache Jenkins Server <jenk...@builds.apache.org>
Subject Hadoop-Mapreduce-trunk - Build # 1109 - Still Failing
Date Thu, 14 Jun 2012 14:18:56 GMT
See https://builds.apache.org/job/Hadoop-Mapreduce-trunk/1109/

###################################################################################
########################## LAST 60 LINES OF THE CONSOLE ###########################
[...truncated 30148 lines...]
Tests run: 1, Failures: 0, Errors: 0, Skipped: 0, Time elapsed: 0.336 sec
Running org.apache.hadoop.mapreduce.TestChild
Tests run: 1, Failures: 0, Errors: 0, Skipped: 0, Time elapsed: 47.312 sec
Running org.apache.hadoop.mapreduce.filecache.TestURIFragments
Tests run: 1, Failures: 0, Errors: 0, Skipped: 0, Time elapsed: 0.062 sec
Running org.apache.hadoop.mapreduce.TestMapReduce
Tests run: 1, Failures: 0, Errors: 0, Skipped: 0, Time elapsed: 4.37 sec

Results :

Tests run: 424, Failures: 0, Errors: 0, Skipped: 15

[INFO] ------------------------------------------------------------------------
[INFO] Reactor Summary:
[INFO] 
[INFO] hadoop-yarn ....................................... SUCCESS [1.990s]
[INFO] hadoop-yarn-api ................................... SUCCESS [7.988s]
[INFO] hadoop-yarn-common ................................ SUCCESS [30.995s]
[INFO] hadoop-yarn-server ................................ SUCCESS [0.127s]
[INFO] hadoop-yarn-server-common ......................... SUCCESS [4.135s]
[INFO] hadoop-yarn-server-nodemanager .................... SUCCESS [2:25.553s]
[INFO] hadoop-yarn-server-web-proxy ...................... SUCCESS [1.232s]
[INFO] hadoop-yarn-server-resourcemanager ................ SUCCESS [3:32.040s]
[INFO] hadoop-yarn-server-tests .......................... SUCCESS [40.576s]
[INFO] hadoop-mapreduce-client ........................... SUCCESS [0.060s]
[INFO] hadoop-mapreduce-client-core ...................... SUCCESS [38.673s]
[INFO] hadoop-yarn-applications .......................... SUCCESS [0.086s]
[INFO] hadoop-yarn-applications-distributedshell ......... SUCCESS [22.243s]
[INFO] hadoop-yarn-site .................................. SUCCESS [0.158s]
[INFO] hadoop-mapreduce-client-common .................... SUCCESS [19.042s]
[INFO] hadoop-mapreduce-client-shuffle ................... SUCCESS [0.992s]
[INFO] hadoop-mapreduce-client-app ....................... SUCCESS [4:26.729s]
[INFO] hadoop-mapreduce-client-hs ........................ SUCCESS [1:04.824s]
[INFO] hadoop-mapreduce-client-jobclient ................. FAILURE [48:19.533s]
[INFO] Apache Hadoop MapReduce Examples .................. SKIPPED
[INFO] hadoop-mapreduce .................................. SKIPPED
[INFO] ------------------------------------------------------------------------
[INFO] BUILD FAILURE
[INFO] ------------------------------------------------------------------------
[INFO] Total time: 1:02:38.014s
[INFO] Finished at: Thu Jun 14 14:18:27 UTC 2012
[INFO] Final Memory: 81M/310M
[INFO] ------------------------------------------------------------------------
[ERROR] Failed to execute goal org.apache.maven.plugins:maven-surefire-plugin:2.12:test (default-test)
on project hadoop-mapreduce-client-jobclient: Failure or timeout -> [Help 1]
[ERROR] 
[ERROR] To see the full stack trace of the errors, re-run Maven with the -e switch.
[ERROR] Re-run Maven using the -X switch to enable full debug logging.
[ERROR] 
[ERROR] For more information about the errors and possible solutions, please read the following
articles:
[ERROR] [Help 1] http://cwiki.apache.org/confluence/display/MAVEN/MojoExecutionException
[ERROR] 
[ERROR] After correcting the problems, you can resume the build with the command
[ERROR]   mvn <goals> -rf :hadoop-mapreduce-client-jobclient
Build step 'Execute shell' marked build as failure
[FINDBUGS] Skipping publisher since build result is FAILURE
Archiving artifacts
Updating HADOOP-8509
Email was triggered for: Failure
Sending email for trigger: Failure



###################################################################################
############################## FAILED TESTS (if any) ##############################
No tests ran.
Mime
  • Unnamed multipart/mixed (inline, None, 0 bytes)
View raw message