hadoop-mapreduce-dev mailing list archives

Site index · List index
Message view « Date » · « Thread »
Top « Date » · « Thread »
From Apache Jenkins Server <jenk...@builds.apache.org>
Subject Hadoop-Mapreduce-trunk - Build # 1122 - Still Failing
Date Wed, 27 Jun 2012 14:23:03 GMT
See https://builds.apache.org/job/Hadoop-Mapreduce-trunk/1122/

###################################################################################
########################## LAST 60 LINES OF THE CONSOLE ###########################
[...truncated 30678 lines...]
Tests run: 1, Failures: 0, Errors: 0, Skipped: 0, Time elapsed: 4.375 sec

Results :

Tests in error: 
  testGetInvalidJob(org.apache.hadoop.mapreduce.v2.TestNonExistentJob)

Tests run: 425, Failures: 0, Errors: 1, Skipped: 15

[INFO] ------------------------------------------------------------------------
[INFO] Reactor Summary:
[INFO] 
[INFO] hadoop-yarn ....................................... SUCCESS [1.984s]
[INFO] hadoop-yarn-api ................................... SUCCESS [7.927s]
[INFO] hadoop-yarn-common ................................ SUCCESS [31.626s]
[INFO] hadoop-yarn-server ................................ SUCCESS [0.114s]
[INFO] hadoop-yarn-server-common ......................... SUCCESS [4.166s]
[INFO] hadoop-yarn-server-nodemanager .................... SUCCESS [2:24.161s]
[INFO] hadoop-yarn-server-web-proxy ...................... SUCCESS [1.225s]
[INFO] hadoop-yarn-server-resourcemanager ................ SUCCESS [3:31.418s]
[INFO] hadoop-yarn-server-tests .......................... SUCCESS [40.561s]
[INFO] hadoop-mapreduce-client ........................... SUCCESS [0.068s]
[INFO] hadoop-mapreduce-client-core ...................... SUCCESS [38.982s]
[INFO] hadoop-yarn-applications .......................... SUCCESS [0.089s]
[INFO] hadoop-yarn-applications-distributedshell ......... SUCCESS [22.212s]
[INFO] hadoop-yarn-site .................................. SUCCESS [0.158s]
[INFO] hadoop-mapreduce-client-common .................... SUCCESS [18.974s]
[INFO] hadoop-mapreduce-client-shuffle ................... SUCCESS [0.989s]
[INFO] hadoop-mapreduce-client-app ....................... SUCCESS [4:28.767s]
[INFO] hadoop-mapreduce-client-hs ........................ SUCCESS [1:04.930s]
[INFO] hadoop-mapreduce-client-jobclient ................. FAILURE [49:08.407s]
[INFO] Apache Hadoop MapReduce Examples .................. SKIPPED
[INFO] hadoop-mapreduce .................................. SKIPPED
[INFO] ------------------------------------------------------------------------
[INFO] BUILD FAILURE
[INFO] ------------------------------------------------------------------------
[INFO] Total time: 1:03:27.798s
[INFO] Finished at: Wed Jun 27 14:22:50 UTC 2012
[INFO] Final Memory: 81M/477M
[INFO] ------------------------------------------------------------------------
[ERROR] Failed to execute goal org.apache.maven.plugins:maven-surefire-plugin:2.12:test (default-test)
on project hadoop-mapreduce-client-jobclient: Failure or timeout -> [Help 1]
[ERROR] 
[ERROR] To see the full stack trace of the errors, re-run Maven with the -e switch.
[ERROR] Re-run Maven using the -X switch to enable full debug logging.
[ERROR] 
[ERROR] For more information about the errors and possible solutions, please read the following
articles:
[ERROR] [Help 1] http://cwiki.apache.org/confluence/display/MAVEN/MojoExecutionException
[ERROR] 
[ERROR] After correcting the problems, you can resume the build with the command
[ERROR]   mvn <goals> -rf :hadoop-mapreduce-client-jobclient
Build step 'Execute shell' marked build as failure
[FINDBUGS] Skipping publisher since build result is FAILURE
Archiving artifacts
Updating HDFS-3551
Updating HDFS-3535
Updating MAPREDUCE-4228
Updating HADOOP-8129
Email was triggered for: Failure
Sending email for trigger: Failure



###################################################################################
############################## FAILED TESTS (if any) ##############################
No tests ran.
Mime
  • Unnamed multipart/mixed (inline, None, 0 bytes)
View raw message