hadoop-mapreduce-dev mailing list archives

Site index · List index
Message view « Date » · « Thread »
Top « Date » · « Thread »
From Apache Jenkins Server <jenk...@builds.apache.org>
Subject Hadoop-Mapreduce-trunk - Build # 1124 - Still Failing
Date Fri, 29 Jun 2012 14:08:59 GMT
See https://builds.apache.org/job/Hadoop-Mapreduce-trunk/1124/

###################################################################################
########################## LAST 60 LINES OF THE CONSOLE ###########################
[...truncated 30820 lines...]

[INFO] ------------------------------------------------------------------------
[INFO] Reactor Summary:
[INFO] 
[INFO] hadoop-yarn ....................................... SUCCESS [2.418s]
[INFO] hadoop-yarn-api ................................... SUCCESS [8.057s]
[INFO] hadoop-yarn-common ................................ SUCCESS [29.609s]
[INFO] hadoop-yarn-server ................................ SUCCESS [0.109s]
[INFO] hadoop-yarn-server-common ......................... SUCCESS [2.624s]
[INFO] hadoop-yarn-server-nodemanager .................... SUCCESS [2:23.611s]
[INFO] hadoop-yarn-server-web-proxy ...................... SUCCESS [1.260s]
[INFO] hadoop-yarn-server-resourcemanager ................ SUCCESS [3:32.946s]
[INFO] hadoop-yarn-server-tests .......................... SUCCESS [40.566s]
[INFO] hadoop-mapreduce-client ........................... SUCCESS [0.063s]
[INFO] hadoop-mapreduce-client-core ...................... SUCCESS [39.089s]
[INFO] hadoop-yarn-applications .......................... SUCCESS [0.090s]
[INFO] hadoop-yarn-applications-distributedshell ......... SUCCESS [22.220s]
[INFO] hadoop-yarn-site .................................. SUCCESS [0.155s]
[INFO] hadoop-mapreduce-client-common .................... SUCCESS [16.427s]
[INFO] hadoop-mapreduce-client-shuffle ................... SUCCESS [0.989s]
[INFO] hadoop-mapreduce-client-app ....................... SUCCESS [4:27.147s]
[INFO] hadoop-mapreduce-client-hs ........................ SUCCESS [1:07.195s]
[INFO] hadoop-mapreduce-client-jobclient ................. FAILURE [35:26.130s]
[INFO] Apache Hadoop MapReduce Examples .................. SKIPPED
[INFO] hadoop-mapreduce .................................. SKIPPED
[INFO] ------------------------------------------------------------------------
[INFO] BUILD FAILURE
[INFO] ------------------------------------------------------------------------
[INFO] Total time: 49:41.739s
[INFO] Finished at: Fri Jun 29 14:08:49 UTC 2012
[INFO] Final Memory: 26M/256M
[INFO] ------------------------------------------------------------------------
[ERROR] Failed to execute goal org.apache.maven.plugins:maven-surefire-plugin:2.12:test (default-test)
on project hadoop-mapreduce-client-jobclient: There are test failures.
[ERROR] 
[ERROR] Please refer to /home/jenkins/jenkins-slave/workspace/Hadoop-Mapreduce-trunk/trunk/hadoop-mapreduce-project/hadoop-mapreduce-client/hadoop-mapreduce-client-jobclient/target/surefire-reports
for the individual test results.
[ERROR] -> [Help 1]
[ERROR] 
[ERROR] To see the full stack trace of the errors, re-run Maven with the -e switch.
[ERROR] Re-run Maven using the -X switch to enable full debug logging.
[ERROR] 
[ERROR] For more information about the errors and possible solutions, please read the following
articles:
[ERROR] [Help 1] http://cwiki.apache.org/confluence/display/MAVEN/MojoFailureException
[ERROR] 
[ERROR] After correcting the problems, you can resume the build with the command
[ERROR]   mvn <goals> -rf :hadoop-mapreduce-client-jobclient
Build step 'Execute shell' marked build as failure
[FINDBUGS] Skipping publisher since build result is FAILURE
Archiving artifacts
Updating HDFS-3475
Updating MAPREDUCE-4376
Updating HADOOP-8168
Updating HADOOP-8535
Updating HDFS-3571
Updating HDFS-3559
Updating MAPREDUCE-4371
Updating HADOOP-8438
Updating HDFS-3510
Email was triggered for: Failure
Sending email for trigger: Failure



###################################################################################
############################## FAILED TESTS (if any) ##############################
No tests ran.
Mime
  • Unnamed multipart/mixed (inline, None, 0 bytes)
View raw message