hadoop-mapreduce-dev mailing list archives

Site index · List index
Message view « Date » · « Thread »
Top « Date » · « Thread »
From Apache Jenkins Server <jenk...@builds.apache.org>
Subject Hadoop-Mapreduce-trunk - Build # 1121 - Still Failing
Date Tue, 26 Jun 2012 14:22:42 GMT
See https://builds.apache.org/job/Hadoop-Mapreduce-trunk/1121/

###################################################################################
########################## LAST 60 LINES OF THE CONSOLE ###########################
[...truncated 30660 lines...]
Tests in error: 
  testGetInvalidJob(org.apache.hadoop.mapreduce.v2.TestNonExistentJob)

Tests run: 425, Failures: 0, Errors: 1, Skipped: 15

[INFO] ------------------------------------------------------------------------
[INFO] Reactor Summary:
[INFO] 
[INFO] hadoop-yarn ....................................... SUCCESS [1.981s]
[INFO] hadoop-yarn-api ................................... SUCCESS [8.097s]
[INFO] hadoop-yarn-common ................................ SUCCESS [30.637s]
[INFO] hadoop-yarn-server ................................ SUCCESS [0.124s]
[INFO] hadoop-yarn-server-common ......................... SUCCESS [4.085s]
[INFO] hadoop-yarn-server-nodemanager .................... SUCCESS [2:25.117s]
[INFO] hadoop-yarn-server-web-proxy ...................... SUCCESS [1.230s]
[INFO] hadoop-yarn-server-resourcemanager ................ SUCCESS [3:32.502s]
[INFO] hadoop-yarn-server-tests .......................... SUCCESS [41.667s]
[INFO] hadoop-mapreduce-client ........................... SUCCESS [0.061s]
[INFO] hadoop-mapreduce-client-core ...................... SUCCESS [38.769s]
[INFO] hadoop-yarn-applications .......................... SUCCESS [0.089s]
[INFO] hadoop-yarn-applications-distributedshell ......... SUCCESS [22.192s]
[INFO] hadoop-yarn-site .................................. SUCCESS [0.154s]
[INFO] hadoop-mapreduce-client-common .................... SUCCESS [19.748s]
[INFO] hadoop-mapreduce-client-shuffle ................... SUCCESS [1.021s]
[INFO] hadoop-mapreduce-client-app ....................... SUCCESS [4:25.994s]
[INFO] hadoop-mapreduce-client-hs ........................ SUCCESS [1:04.912s]
[INFO] hadoop-mapreduce-client-jobclient ................. FAILURE [48:14.875s]
[INFO] Apache Hadoop MapReduce Examples .................. SKIPPED
[INFO] hadoop-mapreduce .................................. SKIPPED
[INFO] ------------------------------------------------------------------------
[INFO] BUILD FAILURE
[INFO] ------------------------------------------------------------------------
[INFO] Total time: 1:02:34.284s
[INFO] Finished at: Tue Jun 26 14:22:28 UTC 2012
[INFO] Final Memory: 83M/328M
[INFO] ------------------------------------------------------------------------
[ERROR] Failed to execute goal org.apache.maven.plugins:maven-surefire-plugin:2.12:test (default-test)
on project hadoop-mapreduce-client-jobclient: Failure or timeout -> [Help 1]
[ERROR] 
[ERROR] To see the full stack trace of the errors, re-run Maven with the -e switch.
[ERROR] Re-run Maven using the -X switch to enable full debug logging.
[ERROR] 
[ERROR] For more information about the errors and possible solutions, please read the following
articles:
[ERROR] [Help 1] http://cwiki.apache.org/confluence/display/MAVEN/MojoExecutionException
[ERROR] 
[ERROR] After correcting the problems, you can resume the build with the command
[ERROR]   mvn <goals> -rf :hadoop-mapreduce-client-jobclient
Build step 'Execute shell' marked build as failure
[FINDBUGS] Skipping publisher since build result is FAILURE
Archiving artifacts
Updating HDFS-3550
Updating HDFS-3516
Updating HDFS-3498
Updating HDFS-3549
Updating MAPREDUCE-4355
Updating MAPREDUCE-2289
Updating MAPREDUCE-4290
Updating MAPREDUCE-4336
Email was triggered for: Failure
Sending email for trigger: Failure



###################################################################################
############################## FAILED TESTS (if any) ##############################
No tests ran.
Mime
  • Unnamed multipart/mixed (inline, None, 0 bytes)
View raw message