hadoop-mapreduce-dev mailing list archives

Site index · List index
Message view « Date » · « Thread »
Top « Date » · « Thread »
From Sandeep Jangra <sandeepjan...@gmail.com>
Subject Failed to execute goal org.codehaus.mojo:exec-maven-plugin
Date Fri, 11 May 2012 18:14:56 GMT
Hi,

  Any pointers for this?
  I see open bug for this, is there any workaround. I am compiling
mapreduce package in cygwin.

[INFO] Reactor Summary:
[INFO]
[INFO] hadoop-yarn ....................................... SUCCESS [2.563s]
[INFO] hadoop-yarn-api ................................... SUCCESS [8.172s]
[INFO] hadoop-yarn-common ................................ FAILURE [1.875s]
[INFO] hadoop-yarn-server ................................ SKIPPED
[INFO] hadoop-yarn-server-common ......................... SKIPPED
[INFO] hadoop-yarn-server-nodemanager .................... SKIPPED
[INFO] hadoop-yarn-server-web-proxy ...................... SKIPPED
[INFO] hadoop-yarn-server-resourcemanager ................ SKIPPED
[INFO] hadoop-yarn-server-tests .......................... SKIPPED
[INFO] hadoop-mapreduce-client ........................... SKIPPED
[INFO] hadoop-mapreduce-client-core ...................... SKIPPED
[INFO] hadoop-yarn-applications .......................... SKIPPED
[INFO] hadoop-yarn-applications-distributedshell ......... SKIPPED
[INFO] hadoop-yarn-site .................................. SKIPPED
[INFO] hadoop-mapreduce-client-common .................... SKIPPED
[INFO] hadoop-mapreduce-client-shuffle ................... SKIPPED
[INFO] hadoop-mapreduce-client-app ....................... SKIPPED
[INFO] hadoop-mapreduce-client-hs ........................ SKIPPED
[INFO] hadoop-mapreduce-client-jobclient ................. SKIPPED
[INFO] Apache Hadoop MapReduce Examples .................. SKIPPED
[INFO] hadoop-mapreduce .................................. SKIPPED
[INFO]
------------------------------------------------------------------------
[INFO] BUILD FAILURE
[INFO]
------------------------------------------------------------------------
[INFO] Total time: 14.329s
[INFO] Finished at: Fri May 11 11:37:58 EDT 2012
[INFO] Final Memory: 27M/350M
[INFO]
------------------------------------------------------------------------
[ERROR] *Failed to execute goal
org.codehaus.mojo:exec-maven-plugin:1.2:exec (generate-version) on project
hadoop-yarn-common: Command execution failed. Process exited with an error:
1(Exit value: 1) -> [Help 1]*
[ERROR]
[ERROR] To see the full stack trace of the errors, re-run Maven with the -e
switch.
[ERROR] Re-run Maven using the -X switch to enable full debug logging.
[ERROR]
[ERROR] For more information about the errors and possible solutions,
please read the following articles:
[ERROR] [Help 1]
http://cwiki.apache.org/confluence/display/MAVEN/MojoExecutionException

Mime
  • Unnamed multipart/alternative (inline, None, 0 bytes)
View raw message