hadoop-mapreduce-dev mailing list archives

Site index · List index
Message view « Date » · « Thread »
Top « Date » · « Thread »
From Apache Jenkins Server <jenk...@builds.apache.org>
Subject Hadoop-Mapreduce-trunk - Build # 1068 - Still Failing
Date Thu, 03 May 2012 14:03:56 GMT
See https://builds.apache.org/job/Hadoop-Mapreduce-trunk/1068/

###################################################################################
########################## LAST 60 LINES OF THE CONSOLE ###########################
[...truncated 31975 lines...]
Tests run: 421, Failures: 0, Errors: 0, Skipped: 15

[INFO] ------------------------------------------------------------------------
[INFO] Reactor Summary:
[INFO] 
[INFO] hadoop-yarn ....................................... SUCCESS [2.021s]
[INFO] hadoop-yarn-api ................................... SUCCESS [8.204s]
[INFO] hadoop-yarn-common ................................ SUCCESS [30.634s]
[INFO] hadoop-yarn-server ................................ SUCCESS [0.112s]
[INFO] hadoop-yarn-server-common ......................... SUCCESS [4.140s]
[INFO] hadoop-yarn-server-nodemanager .................... SUCCESS [2:05.992s]
[INFO] hadoop-yarn-server-web-proxy ...................... SUCCESS [1.239s]
[INFO] hadoop-yarn-server-resourcemanager ................ SUCCESS [3:25.351s]
[INFO] hadoop-yarn-server-tests .......................... SUCCESS [39.567s]
[INFO] hadoop-mapreduce-client ........................... SUCCESS [0.063s]
[INFO] hadoop-mapreduce-client-core ...................... SUCCESS [10.288s]
[INFO] hadoop-yarn-applications .......................... SUCCESS [0.088s]
[INFO] hadoop-yarn-applications-distributedshell ......... SUCCESS [22.234s]
[INFO] hadoop-yarn-site .................................. SUCCESS [0.160s]
[INFO] hadoop-mapreduce-client-common .................... SUCCESS [19.157s]
[INFO] hadoop-mapreduce-client-shuffle ................... SUCCESS [1.000s]
[INFO] hadoop-mapreduce-client-app ....................... SUCCESS [4:19.514s]
[INFO] hadoop-mapreduce-client-hs ........................ SUCCESS [1:04.256s]
[INFO] hadoop-mapreduce-client-jobclient ................. FAILURE [33:27.485s]
[INFO] Apache Hadoop MapReduce Examples .................. SKIPPED
[INFO] hadoop-mapreduce .................................. SKIPPED
[INFO] ------------------------------------------------------------------------
[INFO] BUILD FAILURE
[INFO] ------------------------------------------------------------------------
[INFO] Total time: 46:42.538s
[INFO] Finished at: Thu May 03 14:03:23 UTC 2012
[INFO] Final Memory: 83M/323M
[INFO] ------------------------------------------------------------------------
[ERROR] Failed to execute goal org.apache.maven.plugins:maven-surefire-plugin:2.12:test (default-test)
on project hadoop-mapreduce-client-jobclient: ExecutionException; nested exception is java.util.concurrent.ExecutionException:
org.apache.maven.surefire.booter.SurefireBooterForkException: Error occurred in starting fork,
check output in log -> [Help 1]
[ERROR] 
[ERROR] To see the full stack trace of the errors, re-run Maven with the -e switch.
[ERROR] Re-run Maven using the -X switch to enable full debug logging.
[ERROR] 
[ERROR] For more information about the errors and possible solutions, please read the following
articles:
[ERROR] [Help 1] http://cwiki.apache.org/confluence/display/MAVEN/MojoExecutionException
[ERROR] 
[ERROR] After correcting the problems, you can resume the build with the command
[ERROR]   mvn <goals> -rf :hadoop-mapreduce-client-jobclient
Build step 'Execute shell' marked build as failure
[FINDBUGS] Skipping publisher since build result is FAILURE
Archiving artifacts
Updating MAPREDUCE-3173
Updating MAPREDUCE-4210
Updating HDFS-3336
Updating HADOOP-8214
Updating HDFS-3330
Updating HADOOP-8185
Updating HADOOP-8325
Updating MAPREDUCE-4219
Updating HADOOP-8342
Updating HDFS-3351
Updating HADOOP-8347
Email was triggered for: Failure
Sending email for trigger: Failure



###################################################################################
############################## FAILED TESTS (if any) ##############################
No tests ran.
Mime
  • Unnamed multipart/mixed (inline, None, 0 bytes)
View raw message