hadoop-mapreduce-dev mailing list archives

Site index · List index
Message view « Date » · « Thread »
Top « Date » · « Thread »
From Apache Jenkins Server <jenk...@builds.apache.org>
Subject Hadoop-Mapreduce-trunk - Build # 1058 - Still Failing
Date Mon, 23 Apr 2012 13:24:12 GMT
See https://builds.apache.org/job/Hadoop-Mapreduce-trunk/1058/

###################################################################################
########################## LAST 60 LINES OF THE CONSOLE ###########################
[...truncated 27951 lines...]

Results :

Tests in error: 
  testAuthenticatedUser(org.apache.hadoop.yarn.server.TestContainerManagerSecurity)
  testMaliceUser(org.apache.hadoop.yarn.server.TestContainerManagerSecurity)
  testUnauthorizedUser(org.apache.hadoop.yarn.server.TestContainerManagerSecurity)

Tests run: 5, Failures: 0, Errors: 3, Skipped: 0

[INFO] ------------------------------------------------------------------------
[INFO] Reactor Summary:
[INFO] 
[INFO] hadoop-yarn ....................................... SUCCESS [2.033s]
[INFO] hadoop-yarn-api ................................... SUCCESS [8.207s]
[INFO] hadoop-yarn-common ................................ SUCCESS [29.620s]
[INFO] hadoop-yarn-server ................................ SUCCESS [0.117s]
[INFO] hadoop-yarn-server-common ......................... SUCCESS [4.052s]
[INFO] hadoop-yarn-server-nodemanager .................... SUCCESS [2:05.648s]
[INFO] hadoop-yarn-server-web-proxy ...................... SUCCESS [1.247s]
[INFO] hadoop-yarn-server-resourcemanager ................ SUCCESS [3:25.698s]
[INFO] hadoop-yarn-server-tests .......................... FAILURE [25.677s]
[INFO] hadoop-mapreduce-client ........................... SKIPPED
[INFO] hadoop-mapreduce-client-core ...................... SKIPPED
[INFO] hadoop-yarn-applications .......................... SKIPPED
[INFO] hadoop-yarn-applications-distributedshell ......... SKIPPED
[INFO] hadoop-yarn-site .................................. SKIPPED
[INFO] hadoop-mapreduce-client-common .................... SKIPPED
[INFO] hadoop-mapreduce-client-shuffle ................... SKIPPED
[INFO] hadoop-mapreduce-client-app ....................... SKIPPED
[INFO] hadoop-mapreduce-client-hs ........................ SKIPPED
[INFO] hadoop-mapreduce-client-jobclient ................. SKIPPED
[INFO] Apache Hadoop MapReduce Examples .................. SKIPPED
[INFO] hadoop-mapreduce .................................. SKIPPED
[INFO] ------------------------------------------------------------------------
[INFO] BUILD FAILURE
[INFO] ------------------------------------------------------------------------
[INFO] Total time: 6:43.321s
[INFO] Finished at: Mon Apr 23 13:23:24 UTC 2012
[INFO] Final Memory: 60M/402M
[INFO] ------------------------------------------------------------------------
[ERROR] Failed to execute goal org.apache.maven.plugins:maven-surefire-plugin:2.12:test (default-test)
on project hadoop-yarn-server-tests: There are test failures.
[ERROR] 
[ERROR] Please refer to /home/jenkins/jenkins-slave/workspace/Hadoop-Mapreduce-trunk/trunk/hadoop-mapreduce-project/hadoop-yarn/hadoop-yarn-server/hadoop-yarn-server-tests/target/surefire-reports
for the individual test results.
[ERROR] -> [Help 1]
[ERROR] 
[ERROR] To see the full stack trace of the errors, re-run Maven with the -e switch.
[ERROR] Re-run Maven using the -X switch to enable full debug logging.
[ERROR] 
[ERROR] For more information about the errors and possible solutions, please read the following
articles:
[ERROR] [Help 1] http://cwiki.apache.org/confluence/display/MAVEN/MojoFailureException
[ERROR] 
[ERROR] After correcting the problems, you can resume the build with the command
[ERROR]   mvn <goals> -rf :hadoop-yarn-server-tests
Build step 'Execute shell' marked build as failure
[FINDBUGS] Skipping publisher since build result is FAILURE
Archiving artifacts
Email was triggered for: Failure
Sending email for trigger: Failure



###################################################################################
############################## FAILED TESTS (if any) ##############################
No tests ran.
Mime
  • Unnamed multipart/mixed (inline, None, 0 bytes)
View raw message