hadoop-mapreduce-dev mailing list archives

Site index · List index
Message view « Date » · « Thread »
Top « Date » · « Thread »
From Apache Jenkins Server <jenk...@builds.apache.org>
Subject Hadoop-Mapreduce-trunk-Commit - Build # 1979 - Still Failing
Date Mon, 02 Apr 2012 02:07:15 GMT
See https://builds.apache.org/job/Hadoop-Mapreduce-trunk-Commit/1979/

###################################################################################
########################## LAST 60 LINES OF THE CONSOLE ###########################
[...truncated 14813 lines...]
     [copy] Copying 1 file to /home/jenkins/jenkins-slave/workspace/Hadoop-Mapreduce-trunk-Commit/trunk/hadoop-mapreduce-project/build/test/cache
     [copy] Copying 1 file to /home/jenkins/jenkins-slave/workspace/Hadoop-Mapreduce-trunk-Commit/trunk/hadoop-mapreduce-project/build/test/cache
     [copy] Copying 1 file to /home/jenkins/jenkins-slave/workspace/Hadoop-Mapreduce-trunk-Commit/trunk/hadoop-mapreduce-project/build/test/cache
     [copy] Copying 1 file to /home/jenkins/jenkins-slave/workspace/Hadoop-Mapreduce-trunk-Commit/trunk/hadoop-mapreduce-project/build/test/cache
     [copy] Copying 1 file to /home/jenkins/jenkins-slave/workspace/Hadoop-Mapreduce-trunk-Commit/trunk/hadoop-mapreduce-project/build/test/cache
     [copy] Copying 1 file to /home/jenkins/jenkins-slave/workspace/Hadoop-Mapreduce-trunk-Commit/trunk/hadoop-mapreduce-project/build/test/concat
     [copy] Copying 1 file to /home/jenkins/jenkins-slave/workspace/Hadoop-Mapreduce-trunk-Commit/trunk/hadoop-mapreduce-project/build/test/concat
     [copy] Copying 1 file to /home/jenkins/jenkins-slave/workspace/Hadoop-Mapreduce-trunk-Commit/trunk/hadoop-mapreduce-project/build/test/concat
     [copy] Copying 1 file to /home/jenkins/jenkins-slave/workspace/Hadoop-Mapreduce-trunk-Commit/trunk/hadoop-mapreduce-project/build/test/concat
     [copy] Copying 1 file to /home/jenkins/jenkins-slave/workspace/Hadoop-Mapreduce-trunk-Commit/trunk/hadoop-mapreduce-project/build/test/concat
     [copy] Copying 1 file to /home/jenkins/jenkins-slave/workspace/Hadoop-Mapreduce-trunk-Commit/trunk/hadoop-mapreduce-project/build/test/concat

run-commit-test:
    [mkdir] Created dir: /home/jenkins/jenkins-slave/workspace/Hadoop-Mapreduce-trunk-Commit/trunk/hadoop-mapreduce-project/build/test/data
    [mkdir] Created dir: /home/jenkins/jenkins-slave/workspace/Hadoop-Mapreduce-trunk-Commit/trunk/hadoop-mapreduce-project/build/test/logs
     [copy] Copying 1 file to /home/jenkins/jenkins-slave/workspace/Hadoop-Mapreduce-trunk-Commit/trunk/hadoop-mapreduce-project/build/test/extraconf
     [copy] Copying 1 file to /home/jenkins/jenkins-slave/workspace/Hadoop-Mapreduce-trunk-Commit/trunk/hadoop-mapreduce-project/build/test/extraconf
    [junit] Running org.apache.hadoop.mapred.TestJobHistoryParsing
    [junit] Tests run: 1, Failures: 0, Errors: 0, Time elapsed: 2.679 sec
    [junit] Running org.apache.hadoop.mapred.TestJobInProgress
    [junit] Tests run: 1, Failures: 0, Errors: 1, Time elapsed: 1.195 sec
    [junit] Test org.apache.hadoop.mapred.TestJobInProgress FAILED
    [junit] Running org.apache.hadoop.mapred.TestJobQueueTaskScheduler
    [junit] Tests run: 3, Failures: 0, Errors: 0, Time elapsed: 1.102 sec
    [junit] Running org.apache.hadoop.mapred.TestKillCompletedJob
    [junit] Tests run: 1, Failures: 0, Errors: 0, Time elapsed: 1.354 sec
    [junit] Running org.apache.hadoop.mapred.TestLostTracker
    [junit] Tests run: 3, Failures: 0, Errors: 0, Time elapsed: 2.049 sec
    [junit] Running org.apache.hadoop.mapred.TestQueueAclsForCurrentUser
    [junit] Tests run: 3, Failures: 0, Errors: 0, Time elapsed: 0.628 sec
    [junit] Running org.apache.hadoop.mapred.TestRackAwareTaskPlacement
    [junit] Tests run: 1, Failures: 0, Errors: 0, Time elapsed: 1.601 sec
    [junit] Running org.apache.hadoop.mapred.TestSeveral
    [junit] Tests run: 0, Failures: 0, Errors: 0, Time elapsed: 0.032 sec
    [junit] Running org.apache.hadoop.mapred.TestSpeculativeExecution
    [junit] Tests run: 5, Failures: 0, Errors: 0, Time elapsed: 3.703 sec
    [junit] Running org.apache.hadoop.mapred.TestTaskLimits
    [junit] Tests run: 3, Failures: 0, Errors: 0, Time elapsed: 3.948 sec
    [junit] Running org.apache.hadoop.mapred.TestTaskTrackerBlacklisting
    [junit] Tests run: 7, Failures: 0, Errors: 0, Time elapsed: 1.852 sec
    [junit] Running org.apache.hadoop.mapred.TestTrackerBlacklistAcrossJobs
    [junit] Tests run: 1, Failures: 0, Errors: 0, Time elapsed: 41.983 sec
    [junit] Running org.apache.hadoop.mapreduce.TestMapReduceLocal
    [junit] Tests run: 1, Failures: 0, Errors: 0, Time elapsed: 25.393 sec

checkfailure:
    [touch] Creating /home/jenkins/jenkins-slave/workspace/Hadoop-Mapreduce-trunk-Commit/trunk/hadoop-mapreduce-project/build/test/testsfailed

BUILD FAILED
/home/jenkins/jenkins-slave/workspace/Hadoop-Mapreduce-trunk-Commit/trunk/hadoop-mapreduce-project/build.xml:744:
The following error occurred while executing this line:
/home/jenkins/jenkins-slave/workspace/Hadoop-Mapreduce-trunk-Commit/trunk/hadoop-mapreduce-project/build.xml:707:
The following error occurred while executing this line:
/home/jenkins/jenkins-slave/workspace/Hadoop-Mapreduce-trunk-Commit/trunk/hadoop-mapreduce-project/build.xml:768:
Tests failed!

Total time: 3 minutes 0 seconds
Build step 'Execute shell' marked build as failure
Recording test results
Updating HDFS-3174
Email was triggered for: Failure
Sending email for trigger: Failure



###################################################################################
############################## FAILED TESTS (if any) ##############################
All tests passed
Mime
  • Unnamed multipart/mixed (inline, None, 0 bytes)
View raw message