hadoop-mapreduce-dev mailing list archives

Site index · List index
Message view « Date » · « Thread »
Top « Date » · « Thread »
From Apache Jenkins Server <jenk...@builds.apache.org>
Subject Hadoop-Mapreduce-trunk - Build # 1037 - Still Failing
Date Sun, 01 Apr 2012 14:14:34 GMT
See https://builds.apache.org/job/Hadoop-Mapreduce-trunk/1037/

###################################################################################
########################## LAST 60 LINES OF THE CONSOLE ###########################
[...truncated 28942 lines...]
  org.apache.hadoop.mapreduce.v2.TestUberAM: Failed to Start org.apache.hadoop.mapreduce.v2.TestMRJobs
  testDefaultCleanupAndAbort(org.apache.hadoop.mapreduce.lib.output.TestJobOutputCommitter):
Failed to Start org.apache.hadoop.mapred.MiniMRCluster
  testCustomAbort(org.apache.hadoop.mapreduce.lib.output.TestJobOutputCommitter): Failed to
Start org.apache.hadoop.mapred.MiniMRCluster
  testCustomCleanup(org.apache.hadoop.mapreduce.lib.output.TestJobOutputCommitter): Failed
to Start org.apache.hadoop.mapred.MiniMRCluster
  testChild(org.apache.hadoop.mapreduce.TestChild): Failed to Start org.apache.hadoop.mapred.MiniMRCluster

Tests run: 404, Failures: 14, Errors: 11, Skipped: 22

[INFO] ------------------------------------------------------------------------
[INFO] Reactor Summary:
[INFO] 
[INFO] hadoop-yarn ....................................... SUCCESS [1.701s]
[INFO] hadoop-yarn-api ................................... SUCCESS [8.408s]
[INFO] hadoop-yarn-common ................................ SUCCESS [25.231s]
[INFO] hadoop-yarn-server ................................ SUCCESS [0.106s]
[INFO] hadoop-yarn-server-common ......................... SUCCESS [4.189s]
[INFO] hadoop-yarn-server-nodemanager .................... SUCCESS [2:05.482s]
[INFO] hadoop-yarn-server-web-proxy ...................... SUCCESS [1.233s]
[INFO] hadoop-yarn-server-resourcemanager ................ SUCCESS [3:16.699s]
[INFO] hadoop-yarn-server-tests .......................... SUCCESS [41.327s]
[INFO] hadoop-mapreduce-client ........................... SUCCESS [0.059s]
[INFO] hadoop-mapreduce-client-core ...................... SUCCESS [8.976s]
[INFO] hadoop-yarn-applications .......................... SUCCESS [0.083s]
[INFO] hadoop-yarn-applications-distributedshell ......... SUCCESS [22.380s]
[INFO] hadoop-yarn-site .................................. SUCCESS [0.144s]
[INFO] hadoop-mapreduce-client-common .................... SUCCESS [18.519s]
[INFO] hadoop-mapreduce-client-shuffle ................... SUCCESS [0.990s]
[INFO] hadoop-mapreduce-client-app ....................... SUCCESS [4:08.536s]
[INFO] hadoop-mapreduce-client-hs ........................ SUCCESS [1:02.425s]
[INFO] hadoop-mapreduce-client-jobclient ................. FAILURE [40:46.217s]
[INFO] Apache Hadoop MapReduce Examples .................. SKIPPED
[INFO] hadoop-mapreduce .................................. SKIPPED
[INFO] ------------------------------------------------------------------------
[INFO] BUILD FAILURE
[INFO] ------------------------------------------------------------------------
[INFO] Total time: 53:33.727s
[INFO] Finished at: Sun Apr 01 14:12:43 UTC 2012
[INFO] Final Memory: 88M/357M
[INFO] ------------------------------------------------------------------------
[ERROR] Failed to execute goal org.apache.maven.plugins:maven-surefire-plugin:2.10:test (default-test)
on project hadoop-mapreduce-client-jobclient: Failure or timeout -> [Help 1]
[ERROR] 
[ERROR] To see the full stack trace of the errors, re-run Maven with the -e switch.
[ERROR] Re-run Maven using the -X switch to enable full debug logging.
[ERROR] 
[ERROR] For more information about the errors and possible solutions, please read the following
articles:
[ERROR] [Help 1] http://cwiki.apache.org/confluence/display/MAVEN/MojoExecutionException
[ERROR] 
[ERROR] After correcting the problems, you can resume the build with the command
[ERROR]   mvn <goals> -rf :hadoop-mapreduce-client-jobclient
Build step 'Execute shell' marked build as failure
[FINDBUGS] Skipping publisher since build result is FAILURE
Archiving artifacts
Updating HDFS-3070
Updating HADOOP-8211
Updating HDFS-3164
Updating HDFS-3172
Updating HDFS-3171
Email was triggered for: Failure
Sending email for trigger: Failure



###################################################################################
############################## FAILED TESTS (if any) ##############################
No tests ran.
Mime
  • Unnamed multipart/mixed (inline, None, 0 bytes)
View raw message