hadoop-mapreduce-dev mailing list archives

Site index · List index
Message view « Date » · « Thread »
Top « Date » · « Thread »
From Apache Jenkins Server <jenk...@builds.apache.org>
Subject Hadoop-Mapreduce-trunk - Build # 1062 - Still Failing
Date Fri, 27 Apr 2012 14:03:35 GMT
See https://builds.apache.org/job/Hadoop-Mapreduce-trunk/1062/

###################################################################################
########################## LAST 60 LINES OF THE CONSOLE ###########################
[...truncated 28868 lines...]
Tests run: 422, Failures: 1, Errors: 0, Skipped: 15

[INFO] ------------------------------------------------------------------------
[INFO] Reactor Summary:
[INFO] 
[INFO] hadoop-yarn ....................................... SUCCESS [2.893s]
[INFO] hadoop-yarn-api ................................... SUCCESS [8.073s]
[INFO] hadoop-yarn-common ................................ SUCCESS [29.776s]
[INFO] hadoop-yarn-server ................................ SUCCESS [0.118s]
[INFO] hadoop-yarn-server-common ......................... SUCCESS [4.040s]
[INFO] hadoop-yarn-server-nodemanager .................... SUCCESS [2:05.834s]
[INFO] hadoop-yarn-server-web-proxy ...................... SUCCESS [1.229s]
[INFO] hadoop-yarn-server-resourcemanager ................ SUCCESS [3:25.932s]
[INFO] hadoop-yarn-server-tests .......................... SUCCESS [40.662s]
[INFO] hadoop-mapreduce-client ........................... SUCCESS [0.062s]
[INFO] hadoop-mapreduce-client-core ...................... SUCCESS [10.200s]
[INFO] hadoop-yarn-applications .......................... SUCCESS [0.089s]
[INFO] hadoop-yarn-applications-distributedshell ......... SUCCESS [22.174s]
[INFO] hadoop-yarn-site .................................. SUCCESS [0.160s]
[INFO] hadoop-mapreduce-client-common .................... SUCCESS [18.689s]
[INFO] hadoop-mapreduce-client-shuffle ................... SUCCESS [0.995s]
[INFO] hadoop-mapreduce-client-app ....................... SUCCESS [4:17.517s]
[INFO] hadoop-mapreduce-client-hs ........................ SUCCESS [1:05.602s]
[INFO] hadoop-mapreduce-client-jobclient ................. FAILURE [32:58.718s]
[INFO] Apache Hadoop MapReduce Examples .................. SKIPPED
[INFO] hadoop-mapreduce .................................. SKIPPED
[INFO] ------------------------------------------------------------------------
[INFO] BUILD FAILURE
[INFO] ------------------------------------------------------------------------
[INFO] Total time: 46:13.793s
[INFO] Finished at: Fri Apr 27 14:02:49 UTC 2012
[INFO] Final Memory: 17M/513M
[INFO] ------------------------------------------------------------------------
[ERROR] Failed to execute goal org.apache.maven.plugins:maven-surefire-plugin:2.12:test (default-test)
on project hadoop-mapreduce-client-jobclient: There are test failures.
[ERROR] 
[ERROR] Please refer to /home/jenkins/jenkins-slave/workspace/Hadoop-Mapreduce-trunk/trunk/hadoop-mapreduce-project/hadoop-mapreduce-client/hadoop-mapreduce-client-jobclient/target/surefire-reports
for the individual test results.
[ERROR] -> [Help 1]
[ERROR] 
[ERROR] To see the full stack trace of the errors, re-run Maven with the -e switch.
[ERROR] Re-run Maven using the -X switch to enable full debug logging.
[ERROR] 
[ERROR] For more information about the errors and possible solutions, please read the following
articles:
[ERROR] [Help 1] http://cwiki.apache.org/confluence/display/MAVEN/MojoFailureException
[ERROR] 
[ERROR] After correcting the problems, you can resume the build with the command
[ERROR]   mvn <goals> -rf :hadoop-mapreduce-client-jobclient
Build step 'Execute shell' marked build as failure
[FINDBUGS] Skipping publisher since build result is FAILURE
Archiving artifacts
Updating HDFS-3322
Updating MAPREDUCE-4138
Updating MAPREDUCE-4189
Updating MAPREDUCE-4169
Updating HDFS-3181
Updating HADOOP-8321
Updating HADOOP-8310
Updating HDFS-3222
Email was triggered for: Failure
Sending email for trigger: Failure



###################################################################################
############################## FAILED TESTS (if any) ##############################
No tests ran.
Mime
  • Unnamed multipart/mixed (inline, None, 0 bytes)
View raw message